Paste number 139514: gtypist.scm fail config.log

Paste number 139514: gtypist.scm fail config.log
Pasted by: gzg
When:6 years, 9 months ago
Share:Tweet this! | http://paste.lisp.org/+2ZNE
Channel:None
Paste contents:
Raw Source | XML | Display As
This file contains any messages produced by compilers while
running configure, to aid debugging if configure makes a mistake.

It was created by GNU Typist configure 2.9.3, which was
generated by GNU Autoconf 2.69.  Invocation command line was

  $ ./configure CONFIG_SHELL=/nix/store/nx4sg06b3njclz7c3q0vn8x2v07vssrq-bash-4.2/bin/bash SHELL=/nix/store/nx4sg06b3njclz7c3q0vn8x2v07vssrq-bash-4.2/bin/bash --prefix=/nix/store/zbshvajldpd6ma6072xi85pv8dqr5dgy-gtypist-2.9.3 --enable-fast-install

## --------- ##
## Platform. ##
## --------- ##

hostname = localhost
uname -m = x86_64
uname -r = 3.2.0-4-amd64
uname -s = Linux
uname -v = #1 SMP Debian 3.2.51-1

/usr/bin/uname -p = unknown
/bin/uname -X     = unknown

/bin/arch              = unknown
/usr/bin/arch -k       = unknown
/usr/convex/getsysinfo = unknown
/usr/bin/hostinfo      = unknown
/bin/machine           = unknown
/usr/bin/oslevel       = unknown
/bin/universe          = unknown

PATH: /nix/store/il77irbsa0d5hbgs20c9riqy0l01wj61-perl-5.16.1/bin
PATH: /nix/store/hw1rvwah1vdigxlaxpnf4qn1b6hvfdsl-ncurses-5.9/bin
PATH: /nix/store/6gin94pa5kqczlwg1krdpfi7g830c983-tar-1.26/bin
PATH: /nix/store/6gin94pa5kqczlwg1krdpfi7g830c983-tar-1.26/sbin
PATH: /nix/store/bvi6vyyhfx0lbyf68m99713qnw3p1mx9-gzip-1.6/bin
PATH: /nix/store/spqiwv2m0ahqyr5gccm2b1yddns7xhqb-bzip2-1.0.6/bin
PATH: /nix/store/7cw9d4f5igaj48nnbylbj9v8g0qviw13-xz-5.0.4/bin
PATH: /nix/store/2ymz4clj47kaplpd0k98f98l90cqbwzi-diffutils-3.3/bin
PATH: /nix/store/3v2qc24yx7abs8dj47hhbl11wb6gjcif-patch-2.7.1/bin
PATH: /nix/store/1933bjqi2izc0nf0cini15zh4f5ai563-coreutils-8.21/bin
PATH: /nix/store/gqnz60g10y9zqz51hx5gajk67b3c5s6p-sed-4.2.2/bin
PATH: /nix/store/vmsk3gwg3z9ra7rzyg34892da1dp72ap-grep-2.14/bin
PATH: /nix/store/d57k8icb4q7wpfzj5hmy867329qq6bh0-findutils-4.4.2/bin
PATH: /nix/store/gsjwmrx0ds4y7ddmiwhim3g8l6ag6j2f-gawk-4.1.0/bin
PATH: /nix/store/6v9p0h7s91i7zv6p6p3s17b3m4vhbjvk-make-3.82/bin
PATH: /nix/store/nx4sg06b3njclz7c3q0vn8x2v07vssrq-bash-4.2/bin
PATH: /nix/store/wfkbgwhif7bn42l4sw9rzcd32ai3jl6z-ld-wrapper-0/bin
PATH: /nix/store/2kqxlzih0d3wc646rzcm2hfpw2ryv71c-binutils-2.23.2/bin
PATH: /nix/store/52998i0m4gr7k35lni8fmg591zsyqamv-gcc-4.7.3/bin
PATH: /nix/store/shamfhyg9hcac63y3bll9p50ixxid8vb-glibc-2.18/bin
PATH: /nix/store/shamfhyg9hcac63y3bll9p50ixxid8vb-glibc-2.18/sbin


## ----------- ##
## Core tests. ##
## ----------- ##

configure:2546: checking for a BSD-compatible install
configure:2614: result: /nix/store/1933bjqi2izc0nf0cini15zh4f5ai563-coreutils-8.21/bin/install -c
configure:2625: checking whether build environment is sane
configure:2680: result: yes
configure:2831: checking for a thread-safe mkdir -p
configure:2870: result: /nix/store/1933bjqi2izc0nf0cini15zh4f5ai563-coreutils-8.21/bin/mkdir -p
configure:2877: checking for gawk
configure:2893: found /nix/store/gsjwmrx0ds4y7ddmiwhim3g8l6ag6j2f-gawk-4.1.0/bin/gawk
configure:2904: result: gawk
configure:2915: checking whether make sets $(MAKE)
configure:2941: result: no
configure:2966: checking whether make supports nested variables
configure:2983: result: yes
configure:3082: checking for style of include used by make
configure:3110: result: GNU
configure:3181: checking for gcc
configure:3197: found /nix/store/52998i0m4gr7k35lni8fmg591zsyqamv-gcc-4.7.3/bin/gcc
configure:3208: result: gcc
configure:3437: checking for C compiler version
configure:3446: gcc --version >&5
gcc (GCC) 4.7.3
Copyright (C) 2012 Free Software Foundation, Inc.
This is free software; see the source for copying conditions.  There is NO
warranty; not even for MERCHANTABILITY or FITNESS FOR A PARTICULAR PURPOSE.

configure:3457: $? = 0
configure:3446: gcc -v >&5
Using built-in specs.
COLLECT_GCC=gcc
COLLECT_LTO_WRAPPER=/nix/store/52998i0m4gr7k35lni8fmg591zsyqamv-gcc-4.7.3/libexec/gcc/x86_64-unknown-linux-gnu/4.7.3/lto-wrapper
Target: x86_64-unknown-linux-gnu
Configured with: 
Thread model: posix
gcc version 4.7.3 (GCC) 
configure:3457: $? = 0
configure:3446: gcc -V >&5
gcc: error: unrecognized command line option '-V'
gcc: fatal error: no input files
compilation terminated.
configure:3457: $? = 1
configure:3446: gcc -qversion >&5
gcc: error: unrecognized command line option '-qversion'
gcc: fatal error: no input files
compilation terminated.
configure:3457: $? = 1
configure:3477: checking whether the C compiler works
configure:3499: gcc    conftest.c  >&5
configure:3503: $? = 0
configure:3551: result: yes
configure:3554: checking for C compiler default output file name
configure:3556: result: a.out
configure:3562: checking for suffix of executables
configure:3569: gcc -o conftest    conftest.c  >&5
configure:3573: $? = 0
configure:3595: result: 
configure:3617: checking whether we are cross compiling
configure:3625: gcc -o conftest    conftest.c  >&5
configure:3629: $? = 0
configure:3636: ./conftest
configure:3640: $? = 0
configure:3655: result: no
configure:3660: checking for suffix of object files
configure:3682: gcc -c   conftest.c >&5
configure:3686: $? = 0
configure:3707: result: o
configure:3711: checking whether we are using the GNU C compiler
configure:3730: gcc -c   conftest.c >&5
configure:3730: $? = 0
configure:3739: result: yes
configure:3748: checking whether gcc accepts -g
configure:3768: gcc -c -g  conftest.c >&5
configure:3768: $? = 0
configure:3809: result: yes
configure:3826: checking for gcc option to accept ISO C89
configure:3889: gcc  -c -g -O2  conftest.c >&5
configure:3889: $? = 0
configure:3902: result: none needed
configure:3924: checking dependency style of gcc
configure:4035: result: gcc3
configure:4056: checking how to run the C preprocessor
configure:4087: gcc -E  conftest.c
configure:4087: $? = 0
configure:4101: gcc -E  conftest.c
conftest.c:11:28: fatal error: ac_nonexistent.h: No such file or directory
compilation terminated.
configure:4101: $? = 1
configure: failed program was:
| /* confdefs.h */
| #define PACKAGE_NAME "GNU Typist"
| #define PACKAGE_TARNAME "gtypist"
| #define PACKAGE_VERSION "2.9.3"
| #define PACKAGE_STRING "GNU Typist 2.9.3"
| #define PACKAGE_BUGREPORT "bug-gtypist@gnu.org"
| #define PACKAGE_URL "http://www.gnu.org/software/gtypist/"
| #define PACKAGE "gtypist"
| #define VERSION "2.9.3"
| /* end confdefs.h.  */
| #include <ac_nonexistent.h>
configure:4126: result: gcc -E
configure:4146: gcc -E  conftest.c
configure:4146: $? = 0
configure:4160: gcc -E  conftest.c
conftest.c:11:28: fatal error: ac_nonexistent.h: No such file or directory
compilation terminated.
configure:4160: $? = 1
configure: failed program was:
| /* confdefs.h */
| #define PACKAGE_NAME "GNU Typist"
| #define PACKAGE_TARNAME "gtypist"
| #define PACKAGE_VERSION "2.9.3"
| #define PACKAGE_STRING "GNU Typist 2.9.3"
| #define PACKAGE_BUGREPORT "bug-gtypist@gnu.org"
| #define PACKAGE_URL "http://www.gnu.org/software/gtypist/"
| #define PACKAGE "gtypist"
| #define VERSION "2.9.3"
| /* end confdefs.h.  */
| #include <ac_nonexistent.h>
configure:4189: checking for grep that handles long lines and -e
configure:4247: result: /nix/store/vmsk3gwg3z9ra7rzyg34892da1dp72ap-grep-2.14/bin/grep
configure:4252: checking for egrep
configure:4314: result: /nix/store/vmsk3gwg3z9ra7rzyg34892da1dp72ap-grep-2.14/bin/grep -E
configure:4319: checking for ANSI C header files
configure:4339: gcc -c -g -O2  conftest.c >&5
configure:4339: $? = 0
configure:4412: gcc -o conftest -g -O2   conftest.c  >&5
configure:4412: $? = 0
configure:4412: ./conftest
configure:4412: $? = 0
configure:4423: result: yes
configure:4436: checking for sys/types.h
configure:4436: gcc -c -g -O2  conftest.c >&5
configure:4436: $? = 0
configure:4436: result: yes
configure:4436: checking for sys/stat.h
configure:4436: gcc -c -g -O2  conftest.c >&5
configure:4436: $? = 0
configure:4436: result: yes
configure:4436: checking for stdlib.h
configure:4436: gcc -c -g -O2  conftest.c >&5
configure:4436: $? = 0
configure:4436: result: yes
configure:4436: checking for string.h
configure:4436: gcc -c -g -O2  conftest.c >&5
configure:4436: $? = 0
configure:4436: result: yes
configure:4436: checking for memory.h
configure:4436: gcc -c -g -O2  conftest.c >&5
configure:4436: $? = 0
configure:4436: result: yes
configure:4436: checking for strings.h
configure:4436: gcc -c -g -O2  conftest.c >&5
configure:4436: $? = 0
configure:4436: result: yes
configure:4436: checking for inttypes.h
configure:4436: gcc -c -g -O2  conftest.c >&5
configure:4436: $? = 0
configure:4436: result: yes
configure:4436: checking for stdint.h
configure:4436: gcc -c -g -O2  conftest.c >&5
configure:4436: $? = 0
configure:4436: result: yes
configure:4436: checking for unistd.h
configure:4436: gcc -c -g -O2  conftest.c >&5
configure:4436: $? = 0
configure:4436: result: yes
configure:4449: checking minix/config.h usability
configure:4449: gcc -c -g -O2  conftest.c >&5
conftest.c:54:26: fatal error: minix/config.h: No such file or directory
compilation terminated.
configure:4449: $? = 1
configure: failed program was:
| /* confdefs.h */
| #define PACKAGE_NAME "GNU Typist"
| #define PACKAGE_TARNAME "gtypist"
| #define PACKAGE_VERSION "2.9.3"
| #define PACKAGE_STRING "GNU Typist 2.9.3"
| #define PACKAGE_BUGREPORT "bug-gtypist@gnu.org"
| #define PACKAGE_URL "http://www.gnu.org/software/gtypist/"
| #define PACKAGE "gtypist"
| #define VERSION "2.9.3"
| #define STDC_HEADERS 1
| #define HAVE_SYS_TYPES_H 1
| #define HAVE_SYS_STAT_H 1
| #define HAVE_STDLIB_H 1
| #define HAVE_STRING_H 1
| #define HAVE_MEMORY_H 1
| #define HAVE_STRINGS_H 1
| #define HAVE_INTTYPES_H 1
| #define HAVE_STDINT_H 1
| #define HAVE_UNISTD_H 1
| /* end confdefs.h.  */
| #include <stdio.h>
| #ifdef HAVE_SYS_TYPES_H
| # include <sys/types.h>
| #endif
| #ifdef HAVE_SYS_STAT_H
| # include <sys/stat.h>
| #endif
| #ifdef STDC_HEADERS
| # include <stdlib.h>
| # include <stddef.h>
| #else
| # ifdef HAVE_STDLIB_H
| #  include <stdlib.h>
| # endif
| #endif
| #ifdef HAVE_STRING_H
| # if !defined STDC_HEADERS && defined HAVE_MEMORY_H
| #  include <memory.h>
| # endif
| # include <string.h>
| #endif
| #ifdef HAVE_STRINGS_H
| # include <strings.h>
| #endif
| #ifdef HAVE_INTTYPES_H
| # include <inttypes.h>
| #endif
| #ifdef HAVE_STDINT_H
| # include <stdint.h>
| #endif
| #ifdef HAVE_UNISTD_H
| # include <unistd.h>
| #endif
| #include <minix/config.h>
configure:4449: result: no
configure:4449: checking minix/config.h presence
configure:4449: gcc -E  conftest.c
conftest.c:21:26: fatal error: minix/config.h: No such file or directory
compilation terminated.
configure:4449: $? = 1
configure: failed program was:
| /* confdefs.h */
| #define PACKAGE_NAME "GNU Typist"
| #define PACKAGE_TARNAME "gtypist"
| #define PACKAGE_VERSION "2.9.3"
| #define PACKAGE_STRING "GNU Typist 2.9.3"
| #define PACKAGE_BUGREPORT "bug-gtypist@gnu.org"
| #define PACKAGE_URL "http://www.gnu.org/software/gtypist/"
| #define PACKAGE "gtypist"
| #define VERSION "2.9.3"
| #define STDC_HEADERS 1
| #define HAVE_SYS_TYPES_H 1
| #define HAVE_SYS_STAT_H 1
| #define HAVE_STDLIB_H 1
| #define HAVE_STRING_H 1
| #define HAVE_MEMORY_H 1
| #define HAVE_STRINGS_H 1
| #define HAVE_INTTYPES_H 1
| #define HAVE_STDINT_H 1
| #define HAVE_UNISTD_H 1
| /* end confdefs.h.  */
| #include <minix/config.h>
configure:4449: result: no
configure:4449: checking for minix/config.h
configure:4449: result: no
configure:4470: checking whether it is safe to define __EXTENSIONS__
configure:4488: gcc -c -g -O2  conftest.c >&5
configure:4488: $? = 0
configure:4495: result: yes
configure:4516: checking for gawk
configure:4543: result: gawk
configure:4602: checking for gcc
configure:4629: result: gcc
configure:4858: checking for C compiler version
configure:4867: gcc --version >&5
gcc (GCC) 4.7.3
Copyright (C) 2012 Free Software Foundation, Inc.
This is free software; see the source for copying conditions.  There is NO
warranty; not even for MERCHANTABILITY or FITNESS FOR A PARTICULAR PURPOSE.

configure:4878: $? = 0
configure:4867: gcc -v >&5
Using built-in specs.
COLLECT_GCC=gcc
COLLECT_LTO_WRAPPER=/nix/store/52998i0m4gr7k35lni8fmg591zsyqamv-gcc-4.7.3/libexec/gcc/x86_64-unknown-linux-gnu/4.7.3/lto-wrapper
Target: x86_64-unknown-linux-gnu
Configured with: 
Thread model: posix
gcc version 4.7.3 (GCC) 
configure:4878: $? = 0
configure:4867: gcc -V >&5
gcc: error: unrecognized command line option '-V'
gcc: fatal error: no input files
compilation terminated.
configure:4878: $? = 1
configure:4867: gcc -qversion >&5
gcc: error: unrecognized command line option '-qversion'
gcc: fatal error: no input files
compilation terminated.
configure:4878: $? = 1
configure:4882: checking whether we are using the GNU C compiler
configure:4910: result: yes
configure:4919: checking whether gcc accepts -g
configure:4980: result: yes
configure:4997: checking for gcc option to accept ISO C89
configure:5073: result: none needed
configure:5095: checking dependency style of gcc
configure:5206: result: gcc3
configure:5221: checking for library containing strerror
configure:5252: gcc -o conftest -g -O2   conftest.c  >&5
configure:5252: $? = 0
configure:5269: result: none required
configure:5278: checking whether ln -s works
configure:5282: result: yes
configure:5289: checking whether make sets $(MAKE)
configure:5315: result: no
configure:5363: checking for ranlib
configure:5379: found /nix/store/2kqxlzih0d3wc646rzcm2hfpw2ryv71c-binutils-2.23.2/bin/ranlib
configure:5390: result: ranlib
configure:5416: checking for bison
configure:5446: result: no
configure:5416: checking for byacc
configure:5446: result: no
configure:5462: checking for ANSI C header files
configure:5566: result: yes
configure:5577: checking for unistd.h
configure:5577: result: yes
configure:5577: checking alloca.h usability
configure:5577: gcc -c -g -O2  conftest.c >&5
configure:5577: $? = 0
configure:5577: result: yes
configure:5577: checking alloca.h presence
configure:5577: gcc -E  conftest.c
configure:5577: $? = 0
configure:5577: result: yes
configure:5577: checking for alloca.h
configure:5577: result: yes
configure:5577: checking argz.h usability
configure:5577: gcc -c -g -O2  conftest.c >&5
configure:5577: $? = 0
configure:5577: result: yes
configure:5577: checking argz.h presence
configure:5577: gcc -E  conftest.c
configure:5577: $? = 0
configure:5577: result: yes
configure:5577: checking for argz.h
configure:5577: result: yes
configure:5577: checking errno.h usability
configure:5577: gcc -c -g -O2  conftest.c >&5
configure:5577: $? = 0
configure:5577: result: yes
configure:5577: checking errno.h presence
configure:5577: gcc -E  conftest.c
configure:5577: $? = 0
configure:5577: result: yes
configure:5577: checking for errno.h
configure:5577: result: yes
configure:5577: checking fcntl.h usability
configure:5577: gcc -c -g -O2  conftest.c >&5
configure:5577: $? = 0
configure:5577: result: yes
configure:5577: checking fcntl.h presence
configure:5577: gcc -E  conftest.c
configure:5577: $? = 0
configure:5577: result: yes
configure:5577: checking for fcntl.h
configure:5577: result: yes
configure:5577: checking langinfo.h usability
configure:5577: gcc -c -g -O2  conftest.c >&5
configure:5577: $? = 0
configure:5577: result: yes
configure:5577: checking langinfo.h presence
configure:5577: gcc -E  conftest.c
configure:5577: $? = 0
configure:5577: result: yes
configure:5577: checking for langinfo.h
configure:5577: result: yes
configure:5577: checking libintl.h usability
configure:5577: gcc -c -g -O2  conftest.c >&5
configure:5577: $? = 0
configure:5577: result: yes
configure:5577: checking libintl.h presence
configure:5577: gcc -E  conftest.c
configure:5577: $? = 0
configure:5577: result: yes
configure:5577: checking for libintl.h
configure:5577: result: yes
configure:5577: checking limits.h usability
configure:5577: gcc -c -g -O2  conftest.c >&5
configure:5577: $? = 0
configure:5577: result: yes
configure:5577: checking limits.h presence
configure:5577: gcc -E  conftest.c
configure:5577: $? = 0
configure:5577: result: yes
configure:5577: checking for limits.h
configure:5577: result: yes
configure:5577: checking locale.h usability
configure:5577: gcc -c -g -O2  conftest.c >&5
configure:5577: $? = 0
configure:5577: result: yes
configure:5577: checking locale.h presence
configure:5577: gcc -E  conftest.c
configure:5577: $? = 0
configure:5577: result: yes
configure:5577: checking for locale.h
configure:5577: result: yes
configure:5577: checking malloc.h usability
configure:5577: gcc -c -g -O2  conftest.c >&5
configure:5577: $? = 0
configure:5577: result: yes
configure:5577: checking malloc.h presence
configure:5577: gcc -E  conftest.c
configure:5577: $? = 0
configure:5577: result: yes
configure:5577: checking for malloc.h
configure:5577: result: yes
configure:5577: checking stddef.h usability
configure:5577: gcc -c -g -O2  conftest.c >&5
configure:5577: $? = 0
configure:5577: result: yes
configure:5577: checking stddef.h presence
configure:5577: gcc -E  conftest.c
configure:5577: $? = 0
configure:5577: result: yes
configure:5577: checking for stddef.h
configure:5577: result: yes
configure:5577: checking stdio_ext.h usability
configure:5577: gcc -c -g -O2  conftest.c >&5
configure:5577: $? = 0
configure:5577: result: yes
configure:5577: checking stdio_ext.h presence
configure:5577: gcc -E  conftest.c
configure:5577: $? = 0
configure:5577: result: yes
configure:5577: checking for stdio_ext.h
configure:5577: result: yes
configure:5577: checking for stdlib.h
configure:5577: result: yes
configure:5577: checking for string.h
configure:5577: result: yes
configure:5577: checking for strings.h
configure:5577: result: yes
configure:5577: checking sys/param.h usability
configure:5577: gcc -c -g -O2  conftest.c >&5
configure:5577: $? = 0
configure:5577: result: yes
configure:5577: checking sys/param.h presence
configure:5577: gcc -E  conftest.c
configure:5577: $? = 0
configure:5577: result: yes
configure:5577: checking for sys/param.h
configure:5577: result: yes
configure:5577: checking for unistd.h
configure:5577: result: yes
configure:5590: checking for stdbool.h that conforms to C99
configure:5657: gcc -c -g -O2  conftest.c >&5
configure:5657: $? = 0
configure:5664: result: yes
configure:5666: checking for _Bool
configure:5666: gcc -c -g -O2  conftest.c >&5
configure:5666: $? = 0
configure:5666: gcc -c -g -O2  conftest.c >&5
conftest.c: In function 'main':
conftest.c:80:20: error: expected expression before ')' token
configure:5666: $? = 1
configure: failed program was:
| /* confdefs.h */
| #define PACKAGE_NAME "GNU Typist"
| #define PACKAGE_TARNAME "gtypist"
| #define PACKAGE_VERSION "2.9.3"
| #define PACKAGE_STRING "GNU Typist 2.9.3"
| #define PACKAGE_BUGREPORT "bug-gtypist@gnu.org"
| #define PACKAGE_URL "http://www.gnu.org/software/gtypist/"
| #define PACKAGE "gtypist"
| #define VERSION "2.9.3"
| #define STDC_HEADERS 1
| #define HAVE_SYS_TYPES_H 1
| #define HAVE_SYS_STAT_H 1
| #define HAVE_STDLIB_H 1
| #define HAVE_STRING_H 1
| #define HAVE_MEMORY_H 1
| #define HAVE_STRINGS_H 1
| #define HAVE_INTTYPES_H 1
| #define HAVE_STDINT_H 1
| #define HAVE_UNISTD_H 1
| #define __EXTENSIONS__ 1
| #define _ALL_SOURCE 1
| #define _GNU_SOURCE 1
| #define _POSIX_PTHREAD_SEMANTICS 1
| #define _TANDEM_SOURCE 1
| #define STDC_HEADERS 1
| #define HAVE_UNISTD_H 1
| #define HAVE_ALLOCA_H 1
| #define HAVE_ARGZ_H 1
| #define HAVE_ERRNO_H 1
| #define HAVE_FCNTL_H 1
| #define HAVE_LANGINFO_H 1
| #define HAVE_LIBINTL_H 1
| #define HAVE_LIMITS_H 1
| #define HAVE_LOCALE_H 1
| #define HAVE_MALLOC_H 1
| #define HAVE_STDDEF_H 1
| #define HAVE_STDIO_EXT_H 1
| #define HAVE_STDLIB_H 1
| #define HAVE_STRING_H 1
| #define HAVE_STRINGS_H 1
| #define HAVE_SYS_PARAM_H 1
| #define HAVE_UNISTD_H 1
| /* end confdefs.h.  */
| #include <stdio.h>
| #ifdef HAVE_SYS_TYPES_H
| # include <sys/types.h>
| #endif
| #ifdef HAVE_SYS_STAT_H
| # include <sys/stat.h>
| #endif
| #ifdef STDC_HEADERS
| # include <stdlib.h>
| # include <stddef.h>
| #else
| # ifdef HAVE_STDLIB_H
| #  include <stdlib.h>
| # endif
| #endif
| #ifdef HAVE_STRING_H
| # if !defined STDC_HEADERS && defined HAVE_MEMORY_H
| #  include <memory.h>
| # endif
| # include <string.h>
| #endif
| #ifdef HAVE_STRINGS_H
| # include <strings.h>
| #endif
| #ifdef HAVE_INTTYPES_H
| # include <inttypes.h>
| #endif
| #ifdef HAVE_STDINT_H
| # include <stdint.h>
| #endif
| #ifdef HAVE_UNISTD_H
| # include <unistd.h>
| #endif
| int
| main ()
| {
| if (sizeof ((_Bool)))
| 	    return 0;
|   ;
|   return 0;
| }
configure:5666: result: yes
configure:5683: checking for an ANSI C-conforming const
configure:5749: gcc -c -g -O2  conftest.c >&5
configure:5749: $? = 0
configure:5756: result: yes
configure:5764: checking for inline
configure:5780: gcc -c -g -O2  conftest.c >&5
configure:5780: $? = 0
configure:5788: result: inline
configure:5806: checking for working volatile
configure:5825: gcc -c -g -O2  conftest.c >&5
configure:5825: $? = 0
configure:5832: result: yes
configure:5840: checking for size_t
configure:5840: gcc -c -g -O2  conftest.c >&5
configure:5840: $? = 0
configure:5840: gcc -c -g -O2  conftest.c >&5
conftest.c: In function 'main':
conftest.c:82:21: error: expected expression before ')' token
configure:5840: $? = 1
configure: failed program was:
| /* confdefs.h */
| #define PACKAGE_NAME "GNU Typist"
| #define PACKAGE_TARNAME "gtypist"
| #define PACKAGE_VERSION "2.9.3"
| #define PACKAGE_STRING "GNU Typist 2.9.3"
| #define PACKAGE_BUGREPORT "bug-gtypist@gnu.org"
| #define PACKAGE_URL "http://www.gnu.org/software/gtypist/"
| #define PACKAGE "gtypist"
| #define VERSION "2.9.3"
| #define STDC_HEADERS 1
| #define HAVE_SYS_TYPES_H 1
| #define HAVE_SYS_STAT_H 1
| #define HAVE_STDLIB_H 1
| #define HAVE_STRING_H 1
| #define HAVE_MEMORY_H 1
| #define HAVE_STRINGS_H 1
| #define HAVE_INTTYPES_H 1
| #define HAVE_STDINT_H 1
| #define HAVE_UNISTD_H 1
| #define __EXTENSIONS__ 1
| #define _ALL_SOURCE 1
| #define _GNU_SOURCE 1
| #define _POSIX_PTHREAD_SEMANTICS 1
| #define _TANDEM_SOURCE 1
| #define STDC_HEADERS 1
| #define HAVE_UNISTD_H 1
| #define HAVE_ALLOCA_H 1
| #define HAVE_ARGZ_H 1
| #define HAVE_ERRNO_H 1
| #define HAVE_FCNTL_H 1
| #define HAVE_LANGINFO_H 1
| #define HAVE_LIBINTL_H 1
| #define HAVE_LIMITS_H 1
| #define HAVE_LOCALE_H 1
| #define HAVE_MALLOC_H 1
| #define HAVE_STDDEF_H 1
| #define HAVE_STDIO_EXT_H 1
| #define HAVE_STDLIB_H 1
| #define HAVE_STRING_H 1
| #define HAVE_STRINGS_H 1
| #define HAVE_SYS_PARAM_H 1
| #define HAVE_UNISTD_H 1
| #define HAVE__BOOL 1
| #define HAVE_STDBOOL_H 1
| /* end confdefs.h.  */
| #include <stdio.h>
| #ifdef HAVE_SYS_TYPES_H
| # include <sys/types.h>
| #endif
| #ifdef HAVE_SYS_STAT_H
| # include <sys/stat.h>
| #endif
| #ifdef STDC_HEADERS
| # include <stdlib.h>
| # include <stddef.h>
| #else
| # ifdef HAVE_STDLIB_H
| #  include <stdlib.h>
| # endif
| #endif
| #ifdef HAVE_STRING_H
| # if !defined STDC_HEADERS && defined HAVE_MEMORY_H
| #  include <memory.h>
| # endif
| # include <string.h>
| #endif
| #ifdef HAVE_STRINGS_H
| # include <strings.h>
| #endif
| #ifdef HAVE_INTTYPES_H
| # include <inttypes.h>
| #endif
| #ifdef HAVE_STDINT_H
| # include <stdint.h>
| #endif
| #ifdef HAVE_UNISTD_H
| # include <unistd.h>
| #endif
| int
| main ()
| {
| if (sizeof ((size_t)))
| 	    return 0;
|   ;
|   return 0;
| }
configure:5840: result: yes
configure:5855: checking whether gcc needs -traditional
configure:5889: result: no
configure:5898: checking for working alloca.h
configure:5915: gcc -o conftest -g -O2   conftest.c  >&5
configure:5915: $? = 0
configure:5923: result: yes
configure:5931: checking for alloca
configure:5968: gcc -o conftest -g -O2   conftest.c  >&5
configure:5968: $? = 0
configure:5976: result: yes
configure:6084: checking for stdlib.h
configure:6084: result: yes
configure:6094: checking for GNU libc compatible malloc
configure:6118: gcc -o conftest -g -O2   conftest.c  >&5
configure:6118: $? = 0
configure:6118: ./conftest
configure:6118: $? = 0
configure:6128: result: yes
configure:6151: checking for stdlib.h
configure:6151: result: yes
configure:6161: checking for GNU libc compatible realloc
configure:6185: gcc -o conftest -g -O2   conftest.c  >&5
configure:6185: $? = 0
configure:6185: ./conftest
configure:6185: $? = 0
configure:6195: result: yes
configure:6216: checking return type of signal handlers
configure:6234: gcc -c -g -O2  conftest.c >&5
conftest.c: In function 'main':
conftest.c:58:1: error: void value not ignored as it ought to be
configure:6234: $? = 1
configure: failed program was:
| /* confdefs.h */
| #define PACKAGE_NAME "GNU Typist"
| #define PACKAGE_TARNAME "gtypist"
| #define PACKAGE_VERSION "2.9.3"
| #define PACKAGE_STRING "GNU Typist 2.9.3"
| #define PACKAGE_BUGREPORT "bug-gtypist@gnu.org"
| #define PACKAGE_URL "http://www.gnu.org/software/gtypist/"
| #define PACKAGE "gtypist"
| #define VERSION "2.9.3"
| #define STDC_HEADERS 1
| #define HAVE_SYS_TYPES_H 1
| #define HAVE_SYS_STAT_H 1
| #define HAVE_STDLIB_H 1
| #define HAVE_STRING_H 1
| #define HAVE_MEMORY_H 1
| #define HAVE_STRINGS_H 1
| #define HAVE_INTTYPES_H 1
| #define HAVE_STDINT_H 1
| #define HAVE_UNISTD_H 1
| #define __EXTENSIONS__ 1
| #define _ALL_SOURCE 1
| #define _GNU_SOURCE 1
| #define _POSIX_PTHREAD_SEMANTICS 1
| #define _TANDEM_SOURCE 1
| #define STDC_HEADERS 1
| #define HAVE_UNISTD_H 1
| #define HAVE_ALLOCA_H 1
| #define HAVE_ARGZ_H 1
| #define HAVE_ERRNO_H 1
| #define HAVE_FCNTL_H 1
| #define HAVE_LANGINFO_H 1
| #define HAVE_LIBINTL_H 1
| #define HAVE_LIMITS_H 1
| #define HAVE_LOCALE_H 1
| #define HAVE_MALLOC_H 1
| #define HAVE_STDDEF_H 1
| #define HAVE_STDIO_EXT_H 1
| #define HAVE_STDLIB_H 1
| #define HAVE_STRING_H 1
| #define HAVE_STRINGS_H 1
| #define HAVE_SYS_PARAM_H 1
| #define HAVE_UNISTD_H 1
| #define HAVE__BOOL 1
| #define HAVE_STDBOOL_H 1
| #define HAVE_ALLOCA_H 1
| #define HAVE_ALLOCA 1
| #define HAVE_STDLIB_H 1
| #define HAVE_MALLOC 1
| #define HAVE_STDLIB_H 1
| #define HAVE_REALLOC 1
| /* end confdefs.h.  */
| #include <sys/types.h>
| #include <signal.h>
| 
| int
| main ()
| {
| return *(signal (0, 0)) (0) == 1;
|   ;
|   return 0;
| }
configure:6241: result: void
configure:6249: checking for working strtod
configure:6290: gcc -o conftest -g -O2   conftest.c  >&5
configure:6290: $? = 0
configure:6290: ./conftest
configure:6290: $? = 0
configure:6300: result: yes
configure:6365: checking for __argz_count
configure:6365: gcc -o conftest -g -O2   conftest.c  >&5
configure:6365: $? = 0
configure:6365: result: yes
configure:6365: checking for __argz_next
configure:6365: gcc -o conftest -g -O2   conftest.c  >&5
configure:6365: $? = 0
configure:6365: result: yes
configure:6365: checking for __argz_stringify
configure:6365: gcc -o conftest -g -O2   conftest.c  >&5
configure:6365: $? = 0
configure:6365: result: yes
configure:6365: checking for dcgettext
configure:6365: gcc -o conftest -g -O2   conftest.c  >&5
conftest.c:79:6: warning: conflicting types for built-in function 'dcgettext' [enabled by default]
configure:6365: $? = 0
configure:6365: result: yes
configure:6365: checking for getcwd
configure:6365: gcc -o conftest -g -O2   conftest.c  >&5
configure:6365: $? = 0
configure:6365: result: yes
configure:6365: checking for getwd
configure:6365: gcc -o conftest -g -O2   conftest.c  >&5
configure:6365: $? = 0
configure:6365: result: yes
configure:6365: checking for mempcpy
configure:6365: gcc -o conftest -g -O2   conftest.c  >&5
conftest.c:82:6: warning: conflicting types for built-in function 'mempcpy' [enabled by default]
configure:6365: $? = 0
configure:6365: result: yes
configure:6365: checking for memset
configure:6365: gcc -o conftest -g -O2   conftest.c  >&5
conftest.c:83:6: warning: conflicting types for built-in function 'memset' [enabled by default]
configure:6365: $? = 0
configure:6365: result: yes
configure:6365: checking for munmap
configure:6365: gcc -o conftest -g -O2   conftest.c  >&5
configure:6365: $? = 0
configure:6365: result: yes
configure:6365: checking for nl_langinfo
configure:6365: gcc -o conftest -g -O2   conftest.c  >&5
configure:6365: $? = 0
configure:6365: result: yes
configure:6365: checking for setlocale
configure:6365: gcc -o conftest -g -O2   conftest.c  >&5
configure:6365: $? = 0
configure:6365: result: yes
configure:6365: checking for stpcpy
configure:6365: gcc -o conftest -g -O2   conftest.c  >&5
conftest.c:87:6: warning: conflicting types for built-in function 'stpcpy' [enabled by default]
configure:6365: $? = 0
configure:6365: result: yes
configure:6365: checking for strcasecmp
configure:6365: gcc -o conftest -g -O2   conftest.c  >&5
conftest.c:88:6: warning: conflicting types for built-in function 'strcasecmp' [enabled by default]
configure:6365: $? = 0
configure:6365: result: yes
configure:6365: checking for strchr
configure:6365: gcc -o conftest -g -O2   conftest.c  >&5
conftest.c:89:6: warning: conflicting types for built-in function 'strchr' [enabled by default]
configure:6365: $? = 0
configure:6365: result: yes
configure:6365: checking for strcspn
configure:6365: gcc -o conftest -g -O2   conftest.c  >&5
conftest.c:90:6: warning: conflicting types for built-in function 'strcspn' [enabled by default]
configure:6365: $? = 0
configure:6365: result: yes
configure:6365: checking for strdup
configure:6365: gcc -o conftest -g -O2   conftest.c  >&5
conftest.c:91:6: warning: conflicting types for built-in function 'strdup' [enabled by default]
configure:6365: $? = 0
configure:6365: result: yes
configure:6365: checking for strstr
configure:6365: gcc -o conftest -g -O2   conftest.c  >&5
conftest.c:92:6: warning: conflicting types for built-in function 'strstr' [enabled by default]
configure:6365: $? = 0
configure:6365: result: yes
configure:6365: checking for strtoul
configure:6365: gcc -o conftest -g -O2   conftest.c  >&5
configure:6365: $? = 0
configure:6365: result: yes
configure:6377: checking ncursesw/ncurses.h usability
configure:6377: gcc -c -g -O2  conftest.c >&5
conftest.c:104:30: fatal error: ncursesw/ncurses.h: No such file or directory
compilation terminated.
configure:6377: $? = 1
configure: failed program was:
| /* confdefs.h */
| #define PACKAGE_NAME "GNU Typist"
| #define PACKAGE_TARNAME "gtypist"
| #define PACKAGE_VERSION "2.9.3"
| #define PACKAGE_STRING "GNU Typist 2.9.3"
| #define PACKAGE_BUGREPORT "bug-gtypist@gnu.org"
| #define PACKAGE_URL "http://www.gnu.org/software/gtypist/"
| #define PACKAGE "gtypist"
| #define VERSION "2.9.3"
| #define STDC_HEADERS 1
| #define HAVE_SYS_TYPES_H 1
| #define HAVE_SYS_STAT_H 1
| #define HAVE_STDLIB_H 1
| #define HAVE_STRING_H 1
| #define HAVE_MEMORY_H 1
| #define HAVE_STRINGS_H 1
| #define HAVE_INTTYPES_H 1
| #define HAVE_STDINT_H 1
| #define HAVE_UNISTD_H 1
| #define __EXTENSIONS__ 1
| #define _ALL_SOURCE 1
| #define _GNU_SOURCE 1
| #define _POSIX_PTHREAD_SEMANTICS 1
| #define _TANDEM_SOURCE 1
| #define STDC_HEADERS 1
| #define HAVE_UNISTD_H 1
| #define HAVE_ALLOCA_H 1
| #define HAVE_ARGZ_H 1
| #define HAVE_ERRNO_H 1
| #define HAVE_FCNTL_H 1
| #define HAVE_LANGINFO_H 1
| #define HAVE_LIBINTL_H 1
| #define HAVE_LIMITS_H 1
| #define HAVE_LOCALE_H 1
| #define HAVE_MALLOC_H 1
| #define HAVE_STDDEF_H 1
| #define HAVE_STDIO_EXT_H 1
| #define HAVE_STDLIB_H 1
| #define HAVE_STRING_H 1
| #define HAVE_STRINGS_H 1
| #define HAVE_SYS_PARAM_H 1
| #define HAVE_UNISTD_H 1
| #define HAVE__BOOL 1
| #define HAVE_STDBOOL_H 1
| #define HAVE_ALLOCA_H 1
| #define HAVE_ALLOCA 1
| #define HAVE_STDLIB_H 1
| #define HAVE_MALLOC 1
| #define HAVE_STDLIB_H 1
| #define HAVE_REALLOC 1
| #define RETSIGTYPE void
| #define HAVE___ARGZ_COUNT 1
| #define HAVE___ARGZ_NEXT 1
| #define HAVE___ARGZ_STRINGIFY 1
| #define HAVE_DCGETTEXT 1
| #define HAVE_GETCWD 1
| #define HAVE_GETWD 1
| #define HAVE_MEMPCPY 1
| #define HAVE_MEMSET 1
| #define HAVE_MUNMAP 1
| #define HAVE_NL_LANGINFO 1
| #define HAVE_SETLOCALE 1
| #define HAVE_STPCPY 1
| #define HAVE_STRCASECMP 1
| #define HAVE_STRCHR 1
| #define HAVE_STRCSPN 1
| #define HAVE_STRDUP 1
| #define HAVE_STRSTR 1
| #define HAVE_STRTOUL 1
| /* end confdefs.h.  */
| #include <stdio.h>
| #ifdef HAVE_SYS_TYPES_H
| # include <sys/types.h>
| #endif
| #ifdef HAVE_SYS_STAT_H
| # include <sys/stat.h>
| #endif
| #ifdef STDC_HEADERS
| # include <stdlib.h>
| # include <stddef.h>
| #else
| # ifdef HAVE_STDLIB_H
| #  include <stdlib.h>
| # endif
| #endif
| #ifdef HAVE_STRING_H
| # if !defined STDC_HEADERS && defined HAVE_MEMORY_H
| #  include <memory.h>
| # endif
| # include <string.h>
| #endif
| #ifdef HAVE_STRINGS_H
| # include <strings.h>
| #endif
| #ifdef HAVE_INTTYPES_H
| # include <inttypes.h>
| #endif
| #ifdef HAVE_STDINT_H
| # include <stdint.h>
| #endif
| #ifdef HAVE_UNISTD_H
| # include <unistd.h>
| #endif
| #include <ncursesw/ncurses.h>
configure:6377: result: no
configure:6377: checking ncursesw/ncurses.h presence
configure:6377: gcc -E  conftest.c
conftest.c:71:30: fatal error: ncursesw/ncurses.h: No such file or directory
compilation terminated.
configure:6377: $? = 1
configure: failed program was:
| /* confdefs.h */
| #define PACKAGE_NAME "GNU Typist"
| #define PACKAGE_TARNAME "gtypist"
| #define PACKAGE_VERSION "2.9.3"
| #define PACKAGE_STRING "GNU Typist 2.9.3"
| #define PACKAGE_BUGREPORT "bug-gtypist@gnu.org"
| #define PACKAGE_URL "http://www.gnu.org/software/gtypist/"
| #define PACKAGE "gtypist"
| #define VERSION "2.9.3"
| #define STDC_HEADERS 1
| #define HAVE_SYS_TYPES_H 1
| #define HAVE_SYS_STAT_H 1
| #define HAVE_STDLIB_H 1
| #define HAVE_STRING_H 1
| #define HAVE_MEMORY_H 1
| #define HAVE_STRINGS_H 1
| #define HAVE_INTTYPES_H 1
| #define HAVE_STDINT_H 1
| #define HAVE_UNISTD_H 1
| #define __EXTENSIONS__ 1
| #define _ALL_SOURCE 1
| #define _GNU_SOURCE 1
| #define _POSIX_PTHREAD_SEMANTICS 1
| #define _TANDEM_SOURCE 1
| #define STDC_HEADERS 1
| #define HAVE_UNISTD_H 1
| #define HAVE_ALLOCA_H 1
| #define HAVE_ARGZ_H 1
| #define HAVE_ERRNO_H 1
| #define HAVE_FCNTL_H 1
| #define HAVE_LANGINFO_H 1
| #define HAVE_LIBINTL_H 1
| #define HAVE_LIMITS_H 1
| #define HAVE_LOCALE_H 1
| #define HAVE_MALLOC_H 1
| #define HAVE_STDDEF_H 1
| #define HAVE_STDIO_EXT_H 1
| #define HAVE_STDLIB_H 1
| #define HAVE_STRING_H 1
| #define HAVE_STRINGS_H 1
| #define HAVE_SYS_PARAM_H 1
| #define HAVE_UNISTD_H 1
| #define HAVE__BOOL 1
| #define HAVE_STDBOOL_H 1
| #define HAVE_ALLOCA_H 1
| #define HAVE_ALLOCA 1
| #define HAVE_STDLIB_H 1
| #define HAVE_MALLOC 1
| #define HAVE_STDLIB_H 1
| #define HAVE_REALLOC 1
| #define RETSIGTYPE void
| #define HAVE___ARGZ_COUNT 1
| #define HAVE___ARGZ_NEXT 1
| #define HAVE___ARGZ_STRINGIFY 1
| #define HAVE_DCGETTEXT 1
| #define HAVE_GETCWD 1
| #define HAVE_GETWD 1
| #define HAVE_MEMPCPY 1
| #define HAVE_MEMSET 1
| #define HAVE_MUNMAP 1
| #define HAVE_NL_LANGINFO 1
| #define HAVE_SETLOCALE 1
| #define HAVE_STPCPY 1
| #define HAVE_STRCASECMP 1
| #define HAVE_STRCHR 1
| #define HAVE_STRCSPN 1
| #define HAVE_STRDUP 1
| #define HAVE_STRSTR 1
| #define HAVE_STRTOUL 1
| /* end confdefs.h.  */
| #include <ncursesw/ncurses.h>
configure:6377: result: no
configure:6377: checking for ncursesw/ncurses.h
configure:6377: result: no
configure:6383: checking for add_wch in -lncursesw
configure:6408: gcc -o conftest -g -O2   conftest.c -lncursesw   >&5
configure:6408: $? = 0
configure:6417: result: yes

## ---------------- ##
## Cache variables. ##
## ---------------- ##

ac_cv_c_compiler_gnu=yes
ac_cv_c_const=yes
ac_cv_c_inline=inline
ac_cv_c_volatile=yes
ac_cv_env_CC_set=
ac_cv_env_CC_value=
ac_cv_env_CFLAGS_set=
ac_cv_env_CFLAGS_value=
ac_cv_env_CPPFLAGS_set=
ac_cv_env_CPPFLAGS_value=
ac_cv_env_CPP_set=
ac_cv_env_CPP_value=
ac_cv_env_EMACSLOADPATH_set=
ac_cv_env_EMACSLOADPATH_value=
ac_cv_env_EMACS_set=
ac_cv_env_EMACS_value=
ac_cv_env_LDFLAGS_set=
ac_cv_env_LDFLAGS_value=
ac_cv_env_LIBS_set=
ac_cv_env_LIBS_value=
ac_cv_env_YACC_set=
ac_cv_env_YACC_value=
ac_cv_env_YFLAGS_set=
ac_cv_env_YFLAGS_value=
ac_cv_env_build_alias_set=
ac_cv_env_build_alias_value=
ac_cv_env_host_alias_set=
ac_cv_env_host_alias_value=
ac_cv_env_target_alias_set=
ac_cv_env_target_alias_value=
ac_cv_func___argz_count=yes
ac_cv_func___argz_next=yes
ac_cv_func___argz_stringify=yes
ac_cv_func_alloca_works=yes
ac_cv_func_dcgettext=yes
ac_cv_func_getcwd=yes
ac_cv_func_getwd=yes
ac_cv_func_malloc_0_nonnull=yes
ac_cv_func_mempcpy=yes
ac_cv_func_memset=yes
ac_cv_func_munmap=yes
ac_cv_func_nl_langinfo=yes
ac_cv_func_realloc_0_nonnull=yes
ac_cv_func_setlocale=yes
ac_cv_func_stpcpy=yes
ac_cv_func_strcasecmp=yes
ac_cv_func_strchr=yes
ac_cv_func_strcspn=yes
ac_cv_func_strdup=yes
ac_cv_func_strstr=yes
ac_cv_func_strtod=yes
ac_cv_func_strtoul=yes
ac_cv_header_alloca_h=yes
ac_cv_header_argz_h=yes
ac_cv_header_errno_h=yes
ac_cv_header_fcntl_h=yes
ac_cv_header_inttypes_h=yes
ac_cv_header_langinfo_h=yes
ac_cv_header_libintl_h=yes
ac_cv_header_limits_h=yes
ac_cv_header_locale_h=yes
ac_cv_header_malloc_h=yes
ac_cv_header_memory_h=yes
ac_cv_header_minix_config_h=no
ac_cv_header_ncursesw_ncurses_h=no
ac_cv_header_stdbool_h=yes
ac_cv_header_stdc=yes
ac_cv_header_stddef_h=yes
ac_cv_header_stdint_h=yes
ac_cv_header_stdio_ext_h=yes
ac_cv_header_stdlib_h=yes
ac_cv_header_string_h=yes
ac_cv_header_strings_h=yes
ac_cv_header_sys_param_h=yes
ac_cv_header_sys_stat_h=yes
ac_cv_header_sys_types_h=yes
ac_cv_header_unistd_h=yes
ac_cv_lib_ncursesw_add_wch=yes
ac_cv_objext=o
ac_cv_path_EGREP='/nix/store/vmsk3gwg3z9ra7rzyg34892da1dp72ap-grep-2.14/bin/grep -E'
ac_cv_path_GREP=/nix/store/vmsk3gwg3z9ra7rzyg34892da1dp72ap-grep-2.14/bin/grep
ac_cv_path_install='/nix/store/1933bjqi2izc0nf0cini15zh4f5ai563-coreutils-8.21/bin/install -c'
ac_cv_path_mkdir=/nix/store/1933bjqi2izc0nf0cini15zh4f5ai563-coreutils-8.21/bin/mkdir
ac_cv_prog_AWK=gawk
ac_cv_prog_CPP='gcc -E'
ac_cv_prog_ac_ct_CC=gcc
ac_cv_prog_ac_ct_RANLIB=ranlib
ac_cv_prog_cc_c89=
ac_cv_prog_cc_g=yes
ac_cv_prog_gcc_traditional=no
ac_cv_prog_make_make_set=no
ac_cv_safe_to_define___extensions__=yes
ac_cv_search_strerror='none required'
ac_cv_type__Bool=yes
ac_cv_type_signal=void
ac_cv_type_size_t=yes
ac_cv_working_alloca_h=yes
am_cv_CC_dependencies_compiler_type=gcc3
am_cv_make_support_nested_variables=yes

## ----------------- ##
## Output variables. ##
## ----------------- ##

ACLOCAL='${SHELL} /tmp/nix-build-gtypist-2.9.3.drv-0/gtypist-2.9.3/missing aclocal-1.13'
ALLOCA=''
AMDEPBACKSLASH='\'
AMDEP_FALSE='#'
AMDEP_TRUE=''
AMTAR='$${TAR-tar}'
AM_BACKSLASH='\'
AM_DEFAULT_V='$(AM_DEFAULT_VERBOSITY)'
AM_DEFAULT_VERBOSITY='1'
AM_V='$(V)'
AUTOCONF='${SHELL} /tmp/nix-build-gtypist-2.9.3.drv-0/gtypist-2.9.3/missing autoconf'
AUTOHEADER='${SHELL} /tmp/nix-build-gtypist-2.9.3.drv-0/gtypist-2.9.3/missing autoheader'
AUTOMAKE='${SHELL} /tmp/nix-build-gtypist-2.9.3.drv-0/gtypist-2.9.3/missing automake-1.13'
AWK='gawk'
BUILD_INCLUDED_LIBINTL=''
CATOBJEXT=''
CC='gcc'
CCDEPMODE='depmode=gcc3'
CFLAGS='-g -O2'
CFLAG_VISIBILITY=''
CPP='gcc -E'
CPPFLAGS=''
CYGPATH_W='echo'
DATADIRNAME=''
DEFS=''
DEPDIR='.deps'
ECHO_C=''
ECHO_N='-n'
ECHO_T=''
EGREP='/nix/store/vmsk3gwg3z9ra7rzyg34892da1dp72ap-grep-2.14/bin/grep -E'
EMACS=''
EMACSLOADPATH=''
EXEEXT=''
GENCAT=''
GEN_MAN=''
GETTEXT_MACRO_VERSION=''
GLIBC21=''
GLIBC2=''
GMSGFMT=''
GMSGFMT_015=''
GREP='/nix/store/vmsk3gwg3z9ra7rzyg34892da1dp72ap-grep-2.14/bin/grep'
HAVE_ASPRINTF=''
HAVE_NEWLOCALE=''
HAVE_POSIX_PRINTF=''
HAVE_SNPRINTF=''
HAVE_VISIBILITY=''
HAVE_WPRINTF=''
INSTALL_DATA='${INSTALL} -m 644'
INSTALL_PROGRAM='${INSTALL}'
INSTALL_SCRIPT='${INSTALL}'
INSTALL_STRIP_PROGRAM='$(install_sh) -c -s'
INSTOBJEXT=''
INTLBISON=''
INTLLIBS=''
INTLOBJS=''
INTL_DEFAULT_VERBOSITY=''
INTL_LIBTOOL_SUFFIX_PREFIX=''
INTL_MACOSX_LIBS=''
LDFLAGS=''
LIBICONV=''
LIBINTL=''
LIBMULTITHREAD=''
LIBOBJS=''
LIBPTH=''
LIBPTH_PREFIX=''
LIBS=''
LIBTHREAD=''
LN_S='ln -s'
LTLIBC=''
LTLIBICONV=''
LTLIBINTL=''
LTLIBMULTITHREAD=''
LTLIBOBJS=''
LTLIBPTH=''
LTLIBTHREAD=''
MAKEINFO='${SHELL} /tmp/nix-build-gtypist-2.9.3.drv-0/gtypist-2.9.3/missing makeinfo'
MKDIR_P='/nix/store/1933bjqi2izc0nf0cini15zh4f5ai563-coreutils-8.21/bin/mkdir -p'
MSGFMT=''
MSGFMT_015=''
MSGMERGE=''
OBJEXT='o'
PACKAGE='gtypist'
PACKAGE_BUGREPORT='bug-gtypist@gnu.org'
PACKAGE_NAME='GNU Typist'
PACKAGE_STRING='GNU Typist 2.9.3'
PACKAGE_TARNAME='gtypist'
PACKAGE_URL='http://www.gnu.org/software/gtypist/'
PACKAGE_VERSION='2.9.3'
PATH_SEPARATOR=':'
POSUB=''
POW_LIB=''
PRI_MACROS_BROKEN=''
RANLIB='ranlib'
SET_MAKE='MAKE=make'
SHELL='/nix/store/nx4sg06b3njclz7c3q0vn8x2v07vssrq-bash-4.2/bin/bash'
STRIP=''
USE_INCLUDED_LIBINTL=''
USE_NLS=''
VERSION='2.9.3'
WINDRES=''
WOE32=''
WOE32DLL=''
XGETTEXT=''
XGETTEXT_015=''
XGETTEXT_EXTRA_OPTIONS=''
YACC='yacc'
YFLAGS=''
ac_ct_CC='gcc'
am__EXEEXT_FALSE=''
am__EXEEXT_TRUE=''
am__fastdepCC_FALSE='#'
am__fastdepCC_TRUE=''
am__include='include'
am__isrc=''
am__leading_dot='.'
am__nodep='_no'
am__quote=''
am__tar='$${TAR-tar} chof - "$$tardir"'
am__untar='$${TAR-tar} xf -'
bindir='${exec_prefix}/bin'
build=''
build_alias=''
build_cpu=''
build_os=''
build_vendor=''
datadir='${datarootdir}'
datarootdir='${prefix}/share'
docdir='${datarootdir}/doc/${PACKAGE_TARNAME}'
dvidir='${docdir}'
exec_prefix='NONE'
host=''
host_alias=''
host_cpu=''
host_os=''
host_vendor=''
htmldir='${docdir}'
includedir='${prefix}/include'
infodir='${datarootdir}/info'
install_sh='${SHELL} /tmp/nix-build-gtypist-2.9.3.drv-0/gtypist-2.9.3/install-sh'
libdir='${exec_prefix}/lib'
libexecdir='${exec_prefix}/libexec'
lispdir=''
localedir='${datarootdir}/locale'
localstatedir='${prefix}/var'
mandir='${datarootdir}/man'
mkdir_p='$(MKDIR_P)'
oldincludedir='/usr/include'
pdfdir='${docdir}'
prefix='/nix/store/zbshvajldpd6ma6072xi85pv8dqr5dgy-gtypist-2.9.3'
program_transform_name='s,x,x,'
psdir='${docdir}'
sbindir='${exec_prefix}/sbin'
sharedstatedir='${prefix}/com'
sysconfdir='${prefix}/etc'
target_alias=''

## ----------- ##
## confdefs.h. ##
## ----------- ##

/* confdefs.h */
#define PACKAGE_NAME "GNU Typist"
#define PACKAGE_TARNAME "gtypist"
#define PACKAGE_VERSION "2.9.3"
#define PACKAGE_STRING "GNU Typist 2.9.3"
#define PACKAGE_BUGREPORT "bug-gtypist@gnu.org"
#define PACKAGE_URL "http://www.gnu.org/software/gtypist/"
#define PACKAGE "gtypist"
#define VERSION "2.9.3"
#define STDC_HEADERS 1
#define HAVE_SYS_TYPES_H 1
#define HAVE_SYS_STAT_H 1
#define HAVE_STDLIB_H 1
#define HAVE_STRING_H 1
#define HAVE_MEMORY_H 1
#define HAVE_STRINGS_H 1
#define HAVE_INTTYPES_H 1
#define HAVE_STDINT_H 1
#define HAVE_UNISTD_H 1
#define __EXTENSIONS__ 1
#define _ALL_SOURCE 1
#define _GNU_SOURCE 1
#define _POSIX_PTHREAD_SEMANTICS 1
#define _TANDEM_SOURCE 1
#define STDC_HEADERS 1
#define HAVE_UNISTD_H 1
#define HAVE_ALLOCA_H 1
#define HAVE_ARGZ_H 1
#define HAVE_ERRNO_H 1
#define HAVE_FCNTL_H 1
#define HAVE_LANGINFO_H 1
#define HAVE_LIBINTL_H 1
#define HAVE_LIMITS_H 1
#define HAVE_LOCALE_H 1
#define HAVE_MALLOC_H 1
#define HAVE_STDDEF_H 1
#define HAVE_STDIO_EXT_H 1
#define HAVE_STDLIB_H 1
#define HAVE_STRING_H 1
#define HAVE_STRINGS_H 1
#define HAVE_SYS_PARAM_H 1
#define HAVE_UNISTD_H 1
#define HAVE__BOOL 1
#define HAVE_STDBOOL_H 1
#define HAVE_ALLOCA_H 1
#define HAVE_ALLOCA 1
#define HAVE_STDLIB_H 1
#define HAVE_MALLOC 1
#define HAVE_STDLIB_H 1
#define HAVE_REALLOC 1
#define RETSIGTYPE void
#define HAVE___ARGZ_COUNT 1
#define HAVE___ARGZ_NEXT 1
#define HAVE___ARGZ_STRINGIFY 1
#define HAVE_DCGETTEXT 1
#define HAVE_GETCWD 1
#define HAVE_GETWD 1
#define HAVE_MEMPCPY 1
#define HAVE_MEMSET 1
#define HAVE_MUNMAP 1
#define HAVE_NL_LANGINFO 1
#define HAVE_SETLOCALE 1
#define HAVE_STPCPY 1
#define HAVE_STRCASECMP 1
#define HAVE_STRCHR 1
#define HAVE_STRCSPN 1
#define HAVE_STRDUP 1
#define HAVE_STRSTR 1
#define HAVE_STRTOUL 1

configure: exit 1

This paste has no annotations.

Colorize as:
Show Line Numbers

Lisppaste pastes can be made by anyone at any time. Imagine a fearsomely comprehensive disclaimer of liability. Now fear, comprehensively.