Paste number 14829: svn 13x make check

Paste number 14829: svn 13x make check
Pasted by: openmacnews
When:16 years, 7 months ago
Share:Tweet this! | http://paste.lisp.org/+BFX
Channel:None
Paste contents:
Raw Source | XML | Display As
% make check
Running all tests in compat-test...success
Running all tests in config-test...success
Running all tests in diff-diff3-test...success
Running all tests in fs-test...success
Running all tests in hashdump-test...success
Running all tests in locks-test...success
Running all tests in opt-test...success
Running all tests in path-test...success
Running all tests in ra-local-test...success
Running all tests in random-test...success
Running all tests in repos-test...success
Running all tests in stream-test...success
Running all tests in string-test...success
Running all tests in time-test...success
Running all tests in translate-test...success
Running all tests in utf-test...success
Running all tests in target-test.py...success
Running all tests in getopt_tests.py...success
Running all tests in basic_tests.py...success
Running all tests in commit_tests.py...success
Running all tests in update_tests.py...success
Running all tests in switch_tests.py...success
Running all tests in prop_tests.py...success
Running all tests in schedule_tests.py...success
Running all tests in log_tests.py...success
Running all tests in copy_tests.py...success
Running all tests in diff_tests.py...success
Running all tests in export_tests.py...FAILURE
Running all tests in externals_tests.py...FAILURE
Running all tests in merge_tests.py...FAILURE
Running all tests in revert_tests.py...FAILURE
Running all tests in stat_tests.py...FAILURE
Running all tests in trans_tests.py...FAILURE
Running all tests in autoprop_tests.py...FAILURE
Running all tests in blame_tests.py...FAILURE
Running all tests in special_tests.py...FAILURE
Running all tests in svnadmin_tests.py...FAILURE
Running all tests in svnlook_tests.py...FAILURE
Running all tests in svnversion_tests.py...FAILURE
Running all tests in utf8_tests.py...success
Running all tests in history_tests.py...FAILURE
Running all tests in lock_tests.py...FAILURE
Running all tests in cat_tests.py...FAILURE
Running all tests in import_tests.py...FAILURE
Running all tests in changes-test...success
Running all tests in fs-base-test...FAILURE
Running all tests in key-test...success
Running all tests in skel-test...success
Running all tests in strings-reps-test...FAILURE

At least one test FAILED, checking /usr/ports/subversion13x/tests.log
FAIL:  export_tests.py 9: export working copy with property mods
FAIL:  export_tests.py 10: export working copy at base revision
FAIL:  export_tests.py 12: export nonexistant file
FAIL:  export_tests.py 13: export unversioned file
FAIL:  export_tests.py 14: export with state deleted=true
FAIL:  externals_tests.py 1: test checkouts with externals
FAIL:  externals_tests.py 2: update to receive a new external module
FAIL:  externals_tests.py 3: update to lose an external module
FAIL:  externals_tests.py 4: update change to an unmodified external module
FAIL:  externals_tests.py 5: update changes to a modified external module
FAIL:  externals_tests.py 6: update changes under an external module
FAIL:  externals_tests.py 7: commit and update additional externals
FAIL:  externals_tests.py 8: error if external target dir involves '.' or '..'
FAIL:  externals_tests.py 9: test exports with externals
FAIL:  merge_tests.py 1: performing a merge, with mixed results
FAIL:  merge_tests.py 2: merge and add new files/dirs with history
FAIL:  merge_tests.py 3: merge that deletes items
FAIL:  merge_tests.py 4: some simple property merges
FAIL:  merge_tests.py 5: merging a file with no explicit target path
FAIL:  merge_tests.py 6: merge should not die if a target file is absent
FAIL:  merge_tests.py 7: merge on deleted directory in target
FAIL:  merge_tests.py 8: merging similar trees ancestrally unrelated
FAIL:  merge_tests.py 9: merge operations using PREV revision
FAIL:  merge_tests.py 10: merge change into unchanged binary file
FAIL:  merge_tests.py 11: merge one file (issue #1150)
FAIL:  merge_tests.py 12: diff after merge that creates a new file
FAIL:  merge_tests.py 13: merge should skip over unversioned obstructions
FAIL:  merge_tests.py 14: merge into missing must not break working copy
FAIL:  merge_tests.py 15: merge --dry-run adding a new file with props
FAIL:  merge_tests.py 16: merge binary files with common ancestry
FAIL:  merge_tests.py 17: merge with funny characters (issue #1905)
FAIL:  merge_tests.py 18: merge changes to keyword expansion property
FAIL:  merge_tests.py 19: merge prop change into deleted target
FAIL:  merge_tests.py 20: merge a file whose name contains a space
FAIL:  merge_tests.py 21: merge between branches (Issue #2222)
FAIL:  merge_tests.py 22: property merges don't overwrite existing prop-mods
FAIL:  merge_tests.py 23: property merge conflict even without local mods
FAIL:  merge_tests.py 24: undo, then redo a property merge
FAIL:  merge_tests.py 25: cherry-pick a dependent change, get conflict
FAIL:  revert_tests.py 2: revert a replaced file with no properties
FAIL:  stat_tests.py 1: status on unversioned file in current directory
FAIL:  stat_tests.py 2: run 'status -u' when nested additions are pending
FAIL:  stat_tests.py 3: status -vN shows all items in current directory
FAIL:  stat_tests.py 4: status with a versioned file missing
FAIL:  stat_tests.py 5: status on versioned items whose type has changed
FAIL:  stat_tests.py 6: status on versioned items replaced by symlinks
FAIL:  stat_tests.py 7: status -u with new files in the repository
FAIL:  stat_tests.py 8: status for unignored file and directory
FAIL:  stat_tests.py 9: status on missing and unversioned file
FAIL:  stat_tests.py 10: status -u indicates out-of-dateness
FAIL:  stat_tests.py 11: status -u on outdated, added file shows only that
FAIL:  stat_tests.py 12: status -u on working copy deleted in HEAD
FAIL:  stat_tests.py 13: timestamp behaviour
FAIL:  stat_tests.py 14: status on '..' where '..' is not versioned
FAIL:  stat_tests.py 15: status -u in partially non-recursive wc
FAIL:  stat_tests.py 16: a missing dir in the anchor
FAIL:  stat_tests.py 17: status output in XML format
FAIL:  trans_tests.py 1: commit new files with keywords active from birth
FAIL:  trans_tests.py 5: update modified file with eol-style 'native'
FAIL:  trans_tests.py 6: committing eol-style change forces text send
FAIL:  trans_tests.py 7: keyword expansion for lone file in directory
FAIL:  trans_tests.py 8: keyword expanded on cat
FAIL:  trans_tests.py 9: copy, propset svn:eol-style, commit
FAIL:  trans_tests.py 10: propset, commit, check out into another wc
FAIL:  trans_tests.py 11: propset, revert
FAIL:  autoprop_tests.py 1: add: config=no,  commandline=none
FAIL:  autoprop_tests.py 2: add: config=yes, commandline=none
FAIL:  autoprop_tests.py 3: add: config=no,  commandline=yes
FAIL:  autoprop_tests.py 4: add: config=yes, commandline=yes
FAIL:  autoprop_tests.py 5: add: config=no,  commandline=no
FAIL:  autoprop_tests.py 6: add: config=yes, commandline=no
FAIL:  autoprop_tests.py 7: import: config=no,  commandline=none
FAIL:  autoprop_tests.py 8: import: config=yes, commandline=none
FAIL:  autoprop_tests.py 9: import: config=no,  commandline=yes
FAIL:  autoprop_tests.py 10: import: config=yes, commandline=yes
FAIL:  autoprop_tests.py 11: import: config=no,  commandline=no
FAIL:  autoprop_tests.py 12: import: config=yes, commandline=no
FAIL:  autoprop_tests.py 13: add directory
FAIL:  autoprop_tests.py 14: import directory
FAIL:  blame_tests.py 1: annotate a file whose name contains a space
FAIL:  blame_tests.py 2: annotate a binary file
FAIL:  blame_tests.py 3: annotating a directory not allowed
FAIL:  blame_tests.py 4: blame output in XML format
FAIL:  blame_tests.py 5: blame lines from unknown revisions
FAIL:  special_tests.py 1: general symlink handling
FAIL:  special_tests.py 2: replace a normal file with a special file
FAIL:  special_tests.py 3: import and export a symlink
FAIL:  special_tests.py 4: 'svn cp dir1 dir2' which contains a symlink
FAIL:  special_tests.py 5: replace a special file with a non-special file
FAIL:  special_tests.py 6: remove a symlink
FAIL:  svnadmin_tests.py 4: 'svnadmin dump' on copied directory
FAIL:  svnadmin_tests.py 5: 'svnadmin dump' on modified child of copied dir
FAIL:  svnadmin_tests.py 6: 'svnadmin dump --quiet'
FAIL:  svnadmin_tests.py 7: 'svnadmin hotcopy PATH .'
FAIL:  svnadmin_tests.py 8: 'svnadmin hotcopy' checking db/format file
FAIL:  svnlook_tests.py 1: test miscellaneous svnlook features
FAIL:  svnlook_tests.py 2: delete file in moved dir
FAIL:  svnlook_tests.py 3: test the printing of property diffs
FAIL:  svnlook_tests.py 4: svnlook info must allow inconsistent newlines
FAIL:  svnlook_tests.py 5: test --copy-info flag on the changed command
FAIL:  svnversion_tests.py 1: test 'svnversion' on wc and other dirs
FAIL:  svnversion_tests.py 2: test 'svnversion' with svn:externals
FAIL:  history_tests.py 1: verify that 'svn cat' traces renames
FAIL:  history_tests.py 2: verify that 'svn cat' avoids false identities
FAIL:  lock_tests.py 1: lock a file and verify that it's locked
FAIL:  lock_tests.py 2: commit a file and keep lock
FAIL:  lock_tests.py 3: commit a file and release lock
FAIL:  lock_tests.py 4: commit a locked file with a prop change
FAIL:  lock_tests.py 5: lock a file and verify lock breaking behavior
FAIL:  lock_tests.py 6: lock a file and verify lock stealing behavior
FAIL:  lock_tests.py 7: examine the fields of a lockfile for correctness
FAIL:  lock_tests.py 8: verify behavior when a lock in a wc is defunct
FAIL:  lock_tests.py 9: verify svn:needs-lock read-only behavior
FAIL:  lock_tests.py 10: verify svn:needs-lock behavior with defunct lock
FAIL:  lock_tests.py 11: verify lock removal on a deleted path
FAIL:  lock_tests.py 12: lock and unlock some files
FAIL:  lock_tests.py 13: verify removal of a directory with locks inside
FAIL:  lock_tests.py 14: verify status of lock in working copy
FAIL:  lock_tests.py 15: verify status of stolen lock
FAIL:  lock_tests.py 16: verify status of broken lock
FAIL:  lock_tests.py 17: verify error on locking non-existent file
FAIL:  lock_tests.py 18: lock an out-of-date file and ensure failure
FAIL:  lock_tests.py 19: update handles svn:needs-lock correctly
FAIL:  lock_tests.py 20: verify svn:needs-lock behavior with revert
FAIL:  lock_tests.py 21: examine the fields of a lock from a URL
FAIL:  lock_tests.py 22: lock/unlock several files in one go
FAIL:  lock_tests.py 23: lock/unlock switched files
FAIL:  lock_tests.py 24: lock and unlock a file with an URI-unsafe name
FAIL:  lock_tests.py 25: svn:needs-lock and svn:executable, part I
FAIL:  lock_tests.py 26: svn:needs-lock and svn:executable, part II
FAIL:  lock_tests.py 27: commit file with xml-unsafe name and release lock
FAIL:  lock_tests.py 28: verify info path@X or path -rY return repos lock
FAIL:  lock_tests.py 29: (un)lock set of files, one already (un)locked
FAIL:  lock_tests.py 30: show correct lock info on moved path
FAIL:  cat_tests.py 1: cat a local directory
FAIL:  cat_tests.py 2: cat a remote directory
FAIL:  cat_tests.py 3: cat a file at revision BASE
FAIL:  cat_tests.py 4: cat a nonexistant file
FAIL:  cat_tests.py 5: cat should skip uncattable resources
FAIL:  import_tests.py 1: import of executable files
FAIL:  import_tests.py 2: do not import ignored files in imported dirs
FAIL:  import_tests.py 3: avoid creating empty revisions with import
FAIL:  import_tests.py 4: import ignored files in imported dirs
FAIL:  fs-base-test 3: delete mutable nodes from directories
FAIL:  fs-base-test 4: delete nodes tree
FAIL:  fs-base-test 5: abort a transaction
FAIL:  fs-base-test 6: create new items within a copied directory
FAIL:  fs-base-test 8: test skip deltas
FAIL:  fs-base-test 9: ensure no-op for redundant copies
FAIL:  strings-reps-test 1: write a new rep, get a new key back
FAIL:  strings-reps-test 2: write a new rep, then overwrite it
FAIL:  strings-reps-test 3: write and overwrite a new rep; confirm with reads
FAIL:  strings-reps-test 4: write, then delete, a new rep; confirm deletion
FAIL:  strings-reps-test 5: test many strings table functions together
FAIL:  strings-reps-test 6: write a null string
FAIL:  strings-reps-test 7: write a string, then abort during an overwrite
FAIL:  strings-reps-test 8: create and copy a string
At least one test was SKIPPED, checking /usr/ports/subversion13x/tests.log
SKIP:  utf8_tests.py 1: conversion of paths and logs to/from utf8
make: *** [check] Error 1

This paste has no annotations.

Colorize as:
Show Line Numbers

Lisppaste pastes can be made by anyone at any time. Imagine a fearsomely comprehensive disclaimer of liability. Now fear, comprehensively.