Paste number 148729: untitled

Paste number 148729: untitled
Pasted by: alexshendi
When:6 years, 6 months ago
Share:Tweet this! | http://paste.lisp.org/+36RD
Channel:None
Paste contents:
Raw Source | XML | Display As
Installing data files in notifier...
mkdir: cannot create directory ‘/var’: Permission denied
mkdir: cannot create directory ‘/var/cache’: No such file or directory
mkdir: cannot create directory ‘/var/cache/cups’: No such file or directory
mkdir: cannot create directory ‘/var/cache/cups/rss’: No such file or directory
Makefile:65: recipe for target 'install-data' failed
make[1]: *** [install-data] Error 1
Makefile:182: recipe for target 'install-data' failed
make: *** [install-data] Error 1
phase `install' failed after 2 seconds
builder for `/gnu/store/hgjyi4xfk1il1cpbl109j4xmbczi65bj-cups-minimal-2.0.1.drv' failed with exit code 1
@ build-failed /gnu/store/hgjyi4xfk1il1cpbl109j4xmbczi65bj-cups-minimal-2.0.1.drv - 1 builder for `/gnu/store/hgjyi4xfk1il1cpbl109j4xmbczi65bj-cups-minimal-2.0.1.drv' failed with exit code 1
cannot build derivation `/gnu/store/jvzznzrnqx45mp9jyq07ar1ls53l7wz0-cups-filters-1.0.68.drv': 1 dependencies couldn't be built
cannot build derivation `/gnu/store/kb7rrz2kgzkg2vvl7zmrpbj7gnkmbfhj-cups-2.0.1.drv': 1 dependencies couldn't be built
guix build: error: build failed: build of `/gnu/store/kb7rrz2kgzkg2vvl7zmrpbj7gnkmbfhj-cups-2.0.1.drv' failed

This paste has no annotations.

Colorize as:
Show Line Numbers

Lisppaste pastes can be made by anyone at any time. Imagine a fearsomely comprehensive disclaimer of liability. Now fear, comprehensively.