Paste number 318806: guix building

Paste number 318806: guix building
Pasted by: dpg23
When:5 years, 2 days ago
Share:Tweet this! | http://paste.lisp.org/+6TZQ
Channel:None
Paste contents:
Raw Source | XML | Display As
make[5]: Entering directory '/tmp/guix-build-yasm-1.3.0.drv-0/yasm-1.3.0'
make  all-recursive
make[6]: Entering directory '/tmp/guix-build-yasm-1.3.0.drv-0/yasm-1.3.0'
Making all in po
make[7]: Entering directory '/tmp/guix-build-yasm-1.3.0.drv-0/yasm-1.3.0/po'
make[7]: Nothing to be done for 'all'.
make[7]: Leaving directory '/tmp/guix-build-yasm-1.3.0.drv-0/yasm-1.3.0/po'
Making all in .
make[7]: Entering directory '/tmp/guix-build-yasm-1.3.0.drv-0/yasm-1.3.0'
make[7]: Leaving directory '/tmp/guix-build-yasm-1.3.0.drv-0/yasm-1.3.0'
make[6]: Leaving directory '/tmp/guix-build-yasm-1.3.0.drv-0/yasm-1.3.0'
make[5]: Leaving directory '/tmp/guix-build-yasm-1.3.0.drv-0/yasm-1.3.0'
============================================================================
Testsuite summary for yasm 1.3.0
============================================================================
# TOTAL: 44
# PASS:  43
# SKIP:  0
# XFAIL: 0
# FAIL:  1
# XPASS: 0
# ERROR: 0
============================================================================
See ./test-suite.log
Please report to bug-yasm@tortall.net
============================================================================
Makefile:3166: recipe for target 'test-suite.log' failed
make[4]: *** [test-suite.log] Error 1
make[4]: Leaving directory '/tmp/guix-build-yasm-1.3.0.drv-0/yasm-1.3.0'
Makefile:3272: recipe for target 'check-TESTS' failed
make[3]: *** [check-TESTS] Error 2
make[3]: Leaving directory '/tmp/guix-build-yasm-1.3.0.drv-0/yasm-1.3.0'
Makefile:3814: recipe for target 'check-am' failed
make[2]: *** [check-am] Error 2
make[2]: Leaving directory '/tmp/guix-build-yasm-1.3.0.drv-0/yasm-1.3.0'
Makefile:3052: recipe for target 'check-recursive' failed
make[1]: *** [check-recursive] Error 1
make[1]: Leaving directory '/tmp/guix-build-yasm-1.3.0.drv-0/yasm-1.3.0'
Makefile:3817: recipe for target 'check' failed
make: *** [check] Error 2
phase `check' failed after 3.2 seconds
builder for `/gnu/store/8wv8d2asnyh3ac3i7bd2384i9c5i21gd-yasm-1.3.0.drv' failed with exit code 1
@ build-failed /gnu/store/8wv8d2asnyh3ac3i7bd2384i9c5i21gd-yasm-1.3.0.drv - 1 builder for `/gnu/store/8wv8d2asnyh3ac3i7bd2384i9c5i21gd-yasm-1.3.0.drv' failed with exit code 1
guix build: error: build failed: build of `/gnu/store/8wv8d2asnyh3ac3i7bd2384i9c5i21gd-yasm-1.3.0.drv' failed

This paste has no annotations.

Colorize as:
Show Line Numbers

Lisppaste pastes can be made by anyone at any time. Imagine a fearsomely comprehensive disclaimer of liability. Now fear, comprehensively.