Paste number 321199: lilypond failed build output

Paste number 321199: lilypond failed build output
Pasted by: acou_bass
When:5 years, 4 months ago
Share:Tweet this! | http://paste.lisp.org/+6VU7
Channel:None
Paste contents:
Raw Source | XML | Display As
LILYPOND_VERSION=2.19.33 /gnu/store/zgclqf1aja6gp7nypdhyvgdz7d4sp1qz-python-2.7.10/bin/python -tt /tmp/guix-build-lilypond-2.19.33.drv-0/lilypond-2.19.33/scripts/lilypond-book.py -I /tmp/guix-build-lilypond-2.19.33.drv-0/lilypond-2.19.33/Documentation -I ./out-www -I /tmp/guix-build-lilypond-2.19.33.drv-0/build/Documentation/snippets/out -I /tmp/guix-build-lilypond-2.19.33.drv-0/lilypond-2.19.33/Documentation/included -I /tmp/guix-build-lilypond-2.19.33.drv-0/lilypond-2.19.33/Documentation/pictures -I /tmp/guix-build-lilypond-2.19.33.drv-0/lilypond-2.19.33/Documentation -I /tmp/guix-build-lilypond-2.19.33.drv-0/lilypond-2.19.33/input/regression --process='/tmp/guix-build-lilypond-2.19.33.drv-0/build/out-www/bin/lilypond -dbackend=eps --formats=ps,png,pdf  -dinclude-eps-fonts -dgs-load-fonts --header=doctitle --header=doctitleca --header=doctitlecs --header=doctitlede --header=doctitlees --header=doctitlefr --header=doctitlehu --header=doctitleit --header=doctitleja --header=doctitlenl --header=doctitlezh --header=texidoc --header=texidocca --header=texidoccs --header=texidocde --header=texidoces --header=texidocfr --header=texidochu --header=texidocit --header=texidocja --header=texidocnl --header=texidoczh -dcheck-internal-types -ddump-signatures -danti-alias-factor=2' --output=./out-www --format=texi-html --loglevel=WARN --info-images-dir=lilypond --lily-output-dir /tmp/guix-build-lilypond-2.19.33.drv-0/build/out/lybook-db --redirect-lilypond-output /tmp/guix-build-lilypond-2.19.33.drv-0/lilypond-2.19.33/Documentation/notation.tely
langdefs.py: warning: lilypond-doc gettext domain not found.
command failed: /tmp/guix-build-lilypond-2.19.33.drv-0/build/out-www/bin/lilypond -dbackend=eps --formats=ps,png,pdf  -dinclude-eps-fonts -dgs-load-fonts --header=doctitle --header=doctitleca --header=doctitlecs --header=doctitlede --header=doctitlees --header=doctitlefr --header=doctitlehu --header=doctitleit --header=doctitleja --header=doctitlenl --header=doctitlezh --header=texidoc --header=texidocca --header=texidoccs --header=texidocde --header=texidoces --header=texidocfr --header=texidochu --header=texidocit --header=texidocja --header=texidocnl --header=texidoczh -dcheck-internal-types -ddump-signatures -danti-alias-factor=2 -I  "./"  -I  "/tmp/guix-build-lilypond-2.19.33.drv-0/build/Documentation"  -I  "/tmp/guix-build-lilypond-2.19.33.drv-0/lilypond-2.19.33/Documentation"  -I  "/tmp/guix-build-lilypond-2.19.33.drv-0/build/Documentation/out-www"  -I  "/tmp/guix-build-lilypond-2.19.33.drv-0/build/Documentation/snippets/out"  -I  "/tmp/guix-build-lilypond-2.19.33.drv-0/lilypond-2.19.33/Documentation/included"  -I  "/tmp/guix-build-lilypond-2.19.33.drv-0/lilypond-2.19.33/Documentation/pictures"  -I  "/tmp/guix-build-lilypond-2.19.33.drv-0/lilypond-2.19.33/Documentation"  -I  "/tmp/guix-build-lilypond-2.19.33.drv-0/lilypond-2.19.33/input/regression" --formats=eps  -deps-box-padding=3.000000  -dread-file-list -dno-strip-output-dir  "/tmp/guix-build-lilypond-2.19.33.drv-0/build/out/lybook-db/snippet-names--823419370.ly"
Child was terminated by signal 11
Error ignored by lilylib
Error trapped by lilypond-book

Please see /tmp/guix-build-lilypond-2.19.33.drv-0/build/out/lybook-db/snippet-names--823419370.log

/tmp/guix-build-lilypond-2.19.33.drv-0/lilypond-2.19.33/./make/ly-rules.make:26: recipe for target 'out-www/notation.texi' failed
make[1]: *** [out-www/notation.texi] Error 1
make[1]: Leaving directory '/tmp/guix-build-lilypond-2.19.33.drv-0/build/Documentation'
/tmp/guix-build-lilypond-2.19.33.drv-0/lilypond-2.19.33/stepmake/stepmake/generic-targets.make:6: recipe for target 'all' failed
make: *** [all] Error 2
phase `build' failed after 2554.2 seconds
builder for `/gnu/store/jc4zdynbq95w3axffcsiy2q4vyfh1gmc-lilypond-2.19.33.drv' failed with exit code 1
guix package: error: build failed: build of `/gnu/store/jc4zdynbq95w3axffcsiy2q4vyfh1gmc-lilypond-2.19.33.drv' failed

This paste has no annotations.

Colorize as:
Show Line Numbers

Lisppaste pastes can be made by anyone at any time. Imagine a fearsomely comprehensive disclaimer of liability. Now fear, comprehensively.