Paste number 322083: guix node 6.3.1 build failure

Paste number 322083: guix node 6.3.1 build failure
Pasted by: davexunit
When:5 years, 4 months ago
Share:Tweet this! | http://paste.lisp.org/+6WIR
Channel:None
Paste contents:
Raw Source | XML | Display As
[----------] 18 tests from InspectorSocketTest (159 ms total)

[----------] Global test environment tear-down
[==========] 22 tests from 2 test cases ran. (159 ms total)
[  PASSED  ] 22 tests.
make[1]: Leaving directory '/tmp/guix-build-node-6.3.1.drv-0/node-v6.3.1'
/gnu/store/vcx1n5nj4gr52xx5m6gvi7zrwngy06s3-python-2.7.11/bin/python tools/test.py --mode=release -J \
        addons doctool known_issues message pseudo-tty parallel sequential
=== release test-dgram-membership ===
Path: parallel/test-dgram-membership
assert.js:89
  throw new assert.AssertionError({
  ^
AssertionError: Got unwanted exception..
    at _throws (assert.js:348:5)
    at Function.assert.doesNotThrow (assert.js:366:3)
    at Object.<anonymous> (/tmp/guix-build-node-6.3.1.drv-0/node-v6.3.1/test/parallel/test-dgram-membership.js:63:10)
    at Module._compile (module.js:541:32)
    at Object.Module._extensions..js (module.js:550:10)
    at Module.load (module.js:458:32)
    at tryModuleLoad (module.js:417:12)
    at Function.Module._load (module.js:409:3)
    at Module.runMain (module.js:575:10)
    at run (bootstrap_node.js:352:7)
Command: out/Release/node /tmp/guix-build-node-6.3.1.drv-0/node-v6.3.1/test/parallel/test-dgram-membership.js
=== release test-https-connect-address-family ===
Path: parallel/test-https-connect-address-family
events.js:160
      throw er; // Unhandled 'error' event
      ^

Error: getaddrinfo ENOTFOUND localhost localhost:13046
    at errnoException (dns.js:28:10)
    at GetAddrInfoReqWrap.onlookup [as oncomplete] (dns.js:79:26)
Command: out/Release/node /tmp/guix-build-node-6.3.1.drv-0/node-v6.3.1/test/parallel/test-https-connect-address-family.js
=== release test-tls-connect-address-family ===
Path: parallel/test-tls-connect-address-family
events.js:160
      throw er; // Unhandled 'error' event
      ^

Error: getaddrinfo ENOTFOUND localhost localhost:12346
    at errnoException (dns.js:28:10)
    at GetAddrInfoReqWrap.onlookup [as oncomplete] (dns.js:79:26)
Command: out/Release/node /tmp/guix-build-node-6.3.1.drv-0/node-v6.3.1/test/parallel/test-tls-connect-address-family.js
=== release test-debug-host-port ===
Path: sequential/test-debug-host-port
assert.js:89
  throw new assert.AssertionError({
  ^
AssertionError: false == true
    at ChildProcess.proc.on.common.mustCall (/tmp/guix-build-node-6.3.1.drv-0/node-v6.3.1/test/sequential/test-debug-host-port.js:20:7)
    at ChildProcess.<anonymous> (/tmp/guix-build-node-6.3.1.drv-0/node-v6.3.1/test/common.js:409:15)
    at emitTwo (events.js:106:13)
    at ChildProcess.emit (events.js:191:7)
    at Process.ChildProcess._handle.onexit (internal/child_process.js:204:12)
Command: out/Release/node /tmp/guix-build-node-6.3.1.drv-0/node-v6.3.1/test/sequential/test-debug-host-port.js
[00:53|% 100|+ 1183|-   4]: Done
make: *** [Makefile:120: test] Error 1
phase `check' failed after 70.2 seconds
builder for `/gnu/store/zlynacp0lld1a7a9da0pli1s03bca421-node-6.3.1.drv' failed with exit code 1
@ build-failed /gnu/store/zlynacp0lld1a7a9da0pli1s03bca421-node-6.3.1.drv - 1 builder for `/gnu/store/zlynacp0lld1a7a9da0pli1s03bca421-node-6.3.1.drv' failed with exit code 1
guix build: error: build failed: build of `/gnu/store/zlynacp0lld1a7a9da0pli1s03bca421-node-6.3.1.drv' failed

This paste has no annotations.

Colorize as:
Show Line Numbers

Lisppaste pastes can be made by anyone at any time. Imagine a fearsomely comprehensive disclaimer of liability. Now fear, comprehensively.