Paste number 322256: Node-legacy build failure

Paste number 322256: Node-legacy build failure
Pasted by: jlicht
When:3 years, 9 months ago
Share:Tweet this! | http://paste.lisp.org/+6WNK
Channel:None
Paste contents:
Raw Source | XML | Display As
g++ -o obj/release/mksnapshot -m64 obj/release/mksnapshot.o obj/release/libraries.o obj/release/accessors.o obj/release/allocation.o obj/release/api.o obj/release/assembler.o obj/release/ast.o obj/release/atomicops_internals_x86_gcc.o obj/release/bignum-dtoa.o obj/release/bignum.o obj/release/bootstrapper.o obj/release/builtins.o obj/release/cached-powers.o obj/release/checks.o obj/release/circular-queue.o obj/release/code-stubs.o obj/release/codegen.o obj/release/compilation-cache.o obj/release/compiler.o obj/release/contexts.o obj/release/conversions.o obj/release/counters.o obj/release/cpu-profiler.o obj/release/data-flow.o obj/release/dateparser.o obj/release/debug-agent.o obj/release/debug.o obj/release/deoptimizer.o obj/release/disassembler.o obj/release/diy-fp.o obj/release/dtoa.o obj/release/execution.o obj/release/extensions/externalize-string-extension.o obj/release/extensions/gc-extension.o obj/release/factory.o obj/release/fast-dtoa.o obj/release/fixed-dtoa.o obj/release/flags.o obj/release/frame-element.o obj/release/frames.o obj/release/full-codegen.o obj/release/func-name-inferrer.o obj/release/gdb-jit.o obj/release/global-handles.o obj/release/handles.o obj/release/hashmap.o obj/release/heap-profiler.o obj/release/heap.o obj/release/hydrogen-instructions.o obj/release/hydrogen.o obj/release/ic.o obj/release/inspector.o obj/release/interpreter-irregexp.o obj/release/jsregexp.o obj/release/jump-target-heavy.o obj/release/jump-target.o obj/release/lithium-allocator.o obj/release/lithium.o obj/release/liveedit.o obj/release/liveobjectlist.o obj/release/log-utils.o obj/release/log.o obj/release/mark-compact.o obj/release/messages.o obj/release/objects-printer.o obj/release/objects-visiting.o obj/release/objects.o obj/release/parser.o obj/release/platform-linux.o obj/release/platform-posix.o obj/release/preparse-data.o obj/release/preparser.o obj/release/profile-generator.o obj/release/property.o obj/release/regexp-macro-assembler-irregexp.o obj/release/regexp-macro-assembler.o obj/release/regexp-stack.o obj/release/register-allocator.o obj/release/rewriter.o obj/release/runtime-profiler.o obj/release/runtime.o obj/release/safepoint-table.o obj/release/scanner-base.o obj/release/scanner.o obj/release/scopeinfo.o obj/release/scopes.o obj/release/serialize.o obj/release/snapshot-common.o obj/release/spaces.o obj/release/string-search.o obj/release/string-stream.o obj/release/strtod.o obj/release/stub-cache.o obj/release/token.o obj/release/top.o obj/release/type-info.o obj/release/unicode.o obj/release/utils.o obj/release/v8-counters.o obj/release/v8.o obj/release/v8threads.o obj/release/variables.o obj/release/version.o obj/release/virtual-frame-heavy.o obj/release/virtual-frame.o obj/release/x64/assembler-x64.o obj/release/x64/builtins-x64.o obj/release/x64/code-stubs-x64.o obj/release/x64/codegen-x64.o obj/release/x64/cpu-x64.o obj/release/x64/debug-x64.o obj/release/x64/deoptimizer-x64.o obj/release/x64/disasm-x64.o obj/release/x64/frames-x64.o obj/release/x64/full-codegen-x64.o obj/release/x64/ic-x64.o obj/release/x64/jump-target-x64.o obj/release/x64/lithium-codegen-x64.o obj/release/x64/lithium-gap-resolver-x64.o obj/release/x64/lithium-x64.o obj/release/x64/macro-assembler-x64.o obj/release/x64/regexp-macro-assembler-x64.o obj/release/x64/register-allocator-x64.o obj/release/x64/stub-cache-x64.o obj/release/x64/virtual-frame-x64.o obj/release/zone.o obj/release/snapshot-empty.o -lpthread
ld: cannot find crt1.o: No such file or directory
ld: cannot find crti.o: No such file or directory
collect2: error: ld returned 1 exit status
scons: *** [obj/release/mksnapshot] Error 1
scons: building terminated because of errors.
Waf: Leaving directory `/tmp/guix-build-node-legacy-0.5.0.drv-0/node-v0.5.0/build'
Build failed:  -> task failed (err #2): 
	{task: libv8.a SConstruct -> libv8.a}
DEST_OS: linux
DEST_CPU: x64
Parallel Jobs: 1
Product type: program
/gnu/store/frrj3bfbmg5vrd0flh9cf8j64h7cr2v4-gcc-4.9.3/bin/gcc -rdynamic -pthread -g -O3 -DHAVE_OPENSSL=1 -DHAVE_MONOTONIC_CLOCK=1 -D_LARGEFILE_SOURCE -D_FILE_OFFSET_BITS=64 -DHAVE_FDATASYNC=1 -DARCH="x64" -DPLATFORM="linux" -D__POSIX__=1 -Wno-unused-parameter -D_FORTIFY_SOURCE=2 -Idefault/deps/http_parser -I../deps/http_parser ../deps/http_parser/http_parser.c -c -o default/deps/http_parser/http_parser_3.o
make: *** [Makefile:19: program] Error 1
phase `build' failed after 109.0 seconds
note: keeping build directory `/tmp/guix-build-node-legacy-0.5.0.drv-5'
builder for `/gnu/store/bf9wmky168fvy6gyj7qaip22xnvklqi1-node-legacy-0.5.0.drv' failed with exit code 1
@ build-failed /gnu/store/bf9wmky168fvy6gyj7qaip22xnvklqi1-node-legacy-0.5.0.drv - 1 builder for `/gnu/store/bf9wmky168fvy6gyj7qaip22xnvklqi1-node-legacy-0.5.0.drv' failed with exit code 1
guix build: error: build failed: build of `/gnu/store/bf9wmky168fvy6gyj7qaip22xnvklqi1-node-legacy-0.5.0.drv' failed

This paste has no annotations.

Colorize as:
Show Line Numbers

Lisppaste pastes can be made by anyone at any time. Imagine a fearsomely comprehensive disclaimer of liability. Now fear, comprehensively.