Paste number 331927: lfam

Paste number 331927: lfam
Pasted by: pygpgme failure with gpgme-1.7.1
When:5 years, 5 months ago
Share:Tweet this! | http://paste.lisp.org/+7447
Channel:None
Paste contents:
Raw Source | XML | Display As
======================================================================
FAIL: test_encrypt_to_signonly (tests.test_encrypt_decrypt.EncryptDecryptTestCase)
----------------------------------------------------------------------
Traceback (most recent call last):
  File "/tmp/guix-build-python2-pygpgme-0.3.drv-0/pygpgme-0.3/tests/test_encrypt_decrypt.py", line 185, in test_encrypt_to_signonly
    self.assertEqual(exc.args[0], gpgme.ERR_SOURCE_UNKNOWN)
AssertionError: 7 != 0

----------------------------------------------------------------------
Ran 52 tests in 8.014s

FAILED (failures=1)
make: *** [Makefile:7: check] Error 1
phase `check' failed after 8.1 seconds
builder for `/gnu/store/h569035lla8f01pl8ggw18rysaclabdg-python2-pygpgme-0.3.drv' failed with exit code 1

This paste has no annotations.

Colorize as:
Show Line Numbers

Lisppaste pastes can be made by anyone at any time. Imagine a fearsomely comprehensive disclaimer of liability. Now fear, comprehensively.