Paste number 340599: urwid (wicd dependency) failing tests

Paste number 340599: urwid (wicd dependency) failing tests
Pasted by: Apteryx
When:4 years, 8 months ago
Share:Tweet this! | http://paste.lisp.org/+7AT3
Channel:None
Paste contents:
Raw Source | XML | Display As
======================================================================
FAIL: test_erase_line (urwid.tests.test_vterm.TermTest)
----------------------------------------------------------------------
Traceback (most recent call last):
  File "/tmp/guix-build-python2-urwid-1.3.1.drv-0/urwid-1.3.1/urwid/tests/test_vterm.py", line 206, in test_erase_line
    self.expect('12345\n      7890\n               a')
  File "/tmp/guix-build-python2-urwid-1.3.1.drv-0/urwid-1.3.1/urwid/tests/test_vterm.py", line 120, in expect
    self.assertEqual(got, what, desc)
AssertionError: Expected:
'12345\n      7890\n               a'
Got:
'Traceback (most recent call last):\n  File "/tmp/guix-build-python2-urwid-1.3.1.drv-0/urwid-1.3.1/urwid/vterm.py", l\nine 1389, in spawn\n    self.command()\n  File "/tmp/guix-build-python2-urwid-1.3.1.drv-0/urwid-1.3.1/urwid/tests/test_v\nterm.py", line 44, in __call__\n    data = os.read(self.reader, 1024)\nOSError: [Errno 4] Interrupted system call'

======================================================================
FAIL: test_horizontal_resize (urwid.tests.test_vterm.TermTest)
----------------------------------------------------------------------
Traceback (most recent call last):
  File "/tmp/guix-build-python2-urwid-1.3.1.drv-0/urwid-1.3.1/urwid/tests/test_vterm.py", line 175, in test_horizontal_resize
    self.expect('1-' + '\n' * 22 + '3-')
  File "/tmp/guix-build-python2-urwid-1.3.1.drv-0/urwid-1.3.1/urwid/tests/test_vterm.py", line 120, in expect
    self.assertEqual(got, what, desc)
AssertionError: Expected:
'1-\n\n\n\n\n\n\n\n\n\n\n\n\n\n\n\n\n\n\n\n\n\n3-'
Got:
'\n\n\n\n\n\n\n\n\n\n\n\n\n\n3-\nTraceback (most recent call last):\n  File "/tmp/guix-build-python2-urwid-1.3.1.drv-0/urwid-1.3.1/urwid/vterm.py",\n line 1389, in spawn\n    self.command()\n  File "/tmp/guix-build-python2-urwid-1.3.1.drv-0/urwid-1.3.1/urwid/tests/test\n_vterm.py", line 44, in __call__\n    data = os.read(self.reader, 1024)\nOSError: [Errno 4] Interrupted system call'

======================================================================
FAIL: test_linefeed (urwid.tests.test_vterm.TermTest)
----------------------------------------------------------------------
Traceback (most recent call last):
  File "/tmp/guix-build-python2-urwid-1.3.1.drv-0/urwid-1.3.1/urwid/tests/test_vterm.py", line 128, in test_linefeed
    self.expect('hello\nworld')
  File "/tmp/guix-build-python2-urwid-1.3.1.drv-0/urwid-1.3.1/urwid/tests/test_vterm.py", line 120, in expect
    self.assertEqual(got, what, desc)
AssertionError: Expected:
'hello\nworld'
Got:
'Traceback (most recent call last):\n  File "/tmp/guix-build-python2-urwid-1.3.1.drv-0/urwid-1.3.1/urwid/vterm.py", l\nine 1389, in spawn\n    self.command()\n  File "/tmp/guix-build-python2-urwid-1.3.1.drv-0/urwid-1.3.1/urwid/tests/test_v\nterm.py", line 44, in __call__\n    data = os.read(self.reader, 1024)\nOSError: [Errno 4] Interrupted system call'

======================================================================
FAIL: test_vertical_resize (urwid.tests.test_vterm.TermTest)
----------------------------------------------------------------------
Traceback (most recent call last):
  File "/tmp/guix-build-python2-urwid-1.3.1.drv-0/urwid-1.3.1/urwid/tests/test_vterm.py", line 186, in test_vertical_resize
    self.expect('\n' * (y - 2) + '3-' + ' ' * 76 + '-4', desc)
  File "/tmp/guix-build-python2-urwid-1.3.1.drv-0/urwid-1.3.1/urwid/tests/test_vterm.py", line 120, in expect
    self.assertEqual(got, what, desc)
AssertionError: try to rescale to 80x23.
Expected:
'\n\n\n\n\n\n\n\n\n\n\n\n\n\n\n\n\n\n\n\n\n3-                                                                            -4'
Got:
'\n\n\n\n\n\n\n\n\n\n\n\n3-                                                                            -4\n\nTraceback (most recent call last):\n  File "/tmp/guix-build-python2-urwid-1.3.1.drv-0/urwid-1.3.1/urwid/vterm.py", l\nine 1389, in spawn\n    self.command()\n  File "/tmp/guix-build-python2-urwid-1.3.1.drv-0/urwid-1.3.1/urwid/tests/test_v\nterm.py", line 44, in __call__\n    data = os.read(self.reader, 1024)\nOSError: [Errno 4] Interrupted system call'

----------------------------------------------------------------------
Ran 278 tests in 1.204s

FAILED (failures=4)
phase `check' failed after 5.2 seconds
builder for `/gnu/store/d3nn0jqa41d7i28qvs78np7mcii2ljn2-python2-urwid-1.3.1.drv' failed with exit code 1
cannot build derivation `/gnu/store/02zf1ydna5q7ki21qx515f782d5ij8q8-wicd-1.7.4.drv': 1 dependencies couldn't be built
guix system: error: build failed: build of `/gnu/store/02zf1ydna5q7ki21qx515f782d5ij8q8-wicd-1.7.4.drv' failed

This paste has no annotations.

Colorize as:
Show Line Numbers

Lisppaste pastes can be made by anyone at any time. Imagine a fearsomely comprehensive disclaimer of liability. Now fear, comprehensively.