Paste number 345836: glib fails to build

Paste number 345836: glib fails to build
Pasted by: Apteryx
When:5 years, 1 week ago
Share:Tweet this! | http://paste.lisp.org/+7EUK
Channel:None
Paste contents:
Raw Source | XML | Display As
  GICOMP   gir/xrandr-1.3.gir
/gnu/store/0wps368gx0cn3ynrkbhzq5pxf75rng7y-glib-2.50.3/include/glib-2.0/glib/glib-autocleanups.h:41: syntax error, unexpected typedef-name, expecting identifier or '(' in 'typedef GAsyncQueue *GAsyncQueue_autoptr;' at 'GAsyncQueue_autoptr'
/gnu/store/0wps368gx0cn3ynrkbhzq5pxf75rng7y-glib-2.50.3/include/glib-2.0/glib/glib-autocleanups.h:42: syntax error, unexpected typedef-name, expecting identifier or '(' in 'typedef GBookmarkFile *GBookmarkFile_autoptr;' at 'GBookmarkFile_autoptr'
/gnu/store/0wps368gx0cn3ynrkbhzq5pxf75rng7y-glib-2.50.3/include/glib-2.0/glib/glib-autocleanups.h:43: syntax error, unexpected typedef-name, expecting identifier or '(' in 'typedef GBytes *GBytes_autoptr;' at 'GBytes_autoptr'
/gnu/store/0wps368gx0cn3ynrkbhzq5pxf75rng7y-glib-2.50.3/include/glib-2.0/glib/glib-autocleanups.h:44: syntax error, unexpected typedef-name, expecting identifier or '(' in 'typedef GChecksum *GChecksum_autoptr;' at 'GChecksum_autoptr'
/gnu/store/0wps368gx0cn3ynrkbhzq5pxf75rng7y-glib-2.50.3/include/glib-2.0/glib/glib-autocleanups.h:45: syntax error, unexpected typedef-name, expecting identifier or '(' in 'typedef GDateTime *GDateTime_autoptr;' at 'GDateTime_autoptr'
/gnu/store/0wps368gx0cn3ynrkbhzq5pxf75rng7y-glib-2.50.3/include/glib-2.0/glib/glib-autocleanups.h:46: syntax error, unexpected typedef-name, expecting identifier or '(' in 'typedef GDir *GDir_autoptr;' at 'GDir_autoptr'
/gnu/store/0wps368gx0cn3ynrkbhzq5pxf75rng7y-glib-2.50.3/include/glib-2.0/glib/glib-autocleanups.h:47: syntax error, unexpected typedef-name, expecting identifier or '(' in 'typedef GError *GError_autoptr;' at 'GError_autoptr'
/gnu/store/0wps368gx0cn3ynrkbhzq5pxf75rng7y-glib-2.50.3/include/glib-2.0/glib/glib-autocleanups.h:48: syntax error, unexpected typedef-name, expecting identifier or '(' in 'typedef GHashTable *GHashTable_autoptr;' at 'GHashTable_autoptr'
/gnu/store/0wps368gx0cn3ynrkbhzq5pxf75rng7y-glib-2.50.3/include/glib-2.0/glib/glib-autocleanups.h:49: syntax error, unexpected typedef-name, expecting identifier or '(' in 'typedef GHmac *GHmac_autoptr;' at 'GHmac_autoptr'
/gnu/store/0wps368gx0cn3ynrkbhzq5pxf75rng7y-glib-2.50.3/include/glib-2.0/glib/glib-autocleanups.h:50: syntax error, unexpected typedef-name, expecting identifier or '(' in 'typedef GIOChannel *GIOChannel_autoptr;' at 'GIOChannel_autoptr'
/gnu/store/0wps368gx0cn3ynrkbhzq5pxf75rng7y-glib-2.50.3/include/glib-2.0/glib/glib-autocleanups.h:51: syntax error, unexpected typedef-name, expecting identifier or '(' in 'typedef GKeyFile *GKeyFile_autoptr;' at 'GKeyFile_autoptr'
/gnu/store/0wps368gx0cn3ynrkbhzq5pxf75rng7y-glib-2.50.3/include/glib-2.0/glib/glib-autocleanups.h:52: syntax error, unexpected typedef-name, expecting identifier or '(' in 'typedef GList *GList_autoptr;' at 'GList_autoptr'
/gnu/store/0wps368gx0cn3ynrkbhzq5pxf75rng7y-glib-2.50.3/include/glib-2.0/glib/glib-autocleanups.h:53: syntax error, unexpected typedef-name, expecting identifier or '(' in 'typedef GArray *GArray_autoptr;' at 'GArray_autoptr'
/gnu/store/0wps368gx0cn3ynrkbhzq5pxf75rng7y-glib-2.50.3/include/glib-2.0/glib/glib-autocleanups.h:54: syntax error, unexpected typedef-name, expecting identifier or '(' in 'typedef GPtrArray *GPtrArray_autoptr;' at 'GPtrArray_autoptr'
/gnu/store/0wps368gx0cn3ynrkbhzq5pxf75rng7y-glib-2.50.3/include/glib-2.0/glib/glib-autocleanups.h:55: syntax error, unexpected typedef-name, expecting identifier or '(' in 'typedef GByteArray *GByteArray_autoptr;' at 'GByteArray_autoptr'
/gnu/store/0wps368gx0cn3ynrkbhzq5pxf75rng7y-glib-2.50.3/include/glib-2.0/glib/glib-autocleanups.h:56: syntax error, unexpected typedef-name, expecting identifier or '(' in 'typedef GMainContext *GMainContext_autoptr;' at 'GMainContext_autoptr'
/gnu/store/0wps368gx0cn3ynrkbhzq5pxf75rng7y-glib-2.50.3/include/glib-2.0/glib/glib-autocleanups.h:57: syntax error, unexpected typedef-name, expecting identifier or '(' in 'typedef GMainLoop *GMainLoop_autoptr;' at 'GMainLoop_autoptr'
/gnu/store/0wps368gx0cn3ynrkbhzq5pxf75rng7y-glib-2.50.3/include/glib-2.0/glib/glib-autocleanups.h:58: syntax error, unexpected typedef-name, expecting identifier or '(' in 'typedef GSource *GSource_autoptr;' at 'GSource_autoptr'
/gnu/store/0wps368gx0cn3ynrkbhzq5pxf75rng7y-glib-2.50.3/include/glib-2.0/glib/glib-autocleanups.h:59: syntax error, unexpected typedef-name, expecting identifier or '(' in 'typedef GMappedFile *GMappedFile_autoptr;' at 'GMappedFile_autoptr'
/gnu/store/0wps368gx0cn3ynrkbhzq5pxf75rng7y-glib-2.50.3/include/glib-2.0/glib/glib-autocleanups.h:60: syntax error, unexpected typedef-name, expecting identifier or '(' in 'typedef GMarkupParseContext *GMarkupParseContext_autoptr;' at 'GMarkupParseContext_autoptr'
/gnu/store/0wps368gx0cn3ynrkbhzq5pxf75rng7y-glib-2.50.3/include/glib-2.0/glib/glib-autocleanups.h:61: syntax error, unexpected typedef-name, expecting identifier or '(' in 'typedef GNode *GNode_autoptr;' at 'GNode_autoptr'
/gnu/store/0wps368gx0cn3ynrkbhzq5pxf75rng7y-glib-2.50.3/include/glib-2.0/glib/glib-autocleanups.h:62: syntax error, unexpected typedef-name, expecting identifier or '(' in 'typedef GOptionContext *GOptionContext_autoptr;' at 'GOptionContext_autoptr'
/gnu/store/0wps368gx0cn3ynrkbhzq5pxf75rng7y-glib-2.50.3/include/glib-2.0/glib/glib-autocleanups.h:63: syntax error, unexpected typedef-name, expecting identifier or '(' in 'typedef GOptionGroup *GOptionGroup_autoptr;' at 'GOptionGroup_autoptr'
/gnu/store/0wps368gx0cn3ynrkbhzq5pxf75rng7y-glib-2.50.3/include/glib-2.0/glib/glib-autocleanups.h:64: syntax error, unexpected typedef-name, expecting identifier or '(' in 'typedef GPatternSpec *GPatternSpec_autoptr;' at 'GPatternSpec_autoptr'
/gnu/store/0wps368gx0cn3ynrkbhzq5pxf75rng7y-glib-2.50.3/include/glib-2.0/glib/glib-autocleanups.h:65: syntax error, unexpected typedef-name, expecting identifier or '(' in 'typedef GQueue *GQueue_autoptr;' at 'GQueue_autoptr'
/gnu/store/0wps368gx0cn3ynrkbhzq5pxf75rng7y-glib-2.50.3/include/glib-2.0/glib/glib-autocleanups.h:67: syntax error, unexpected typedef-name, expecting identifier or '(' in 'typedef GRand *GRand_autoptr;' at 'GRand_autoptr'
/gnu/store/0wps368gx0cn3ynrkbhzq5pxf75rng7y-glib-2.50.3/include/glib-2.0/glib/glib-autocleanups.h:68: syntax error, unexpected typedef-name, expecting identifier or '(' in 'typedef GRegex *GRegex_autoptr;' at 'GRegex_autoptr'
/gnu/store/0wps368gx0cn3ynrkbhzq5pxf75rng7y-glib-2.50.3/include/glib-2.0/glib/glib-autocleanups.h:69: syntax error, unexpected typedef-name, expecting identifier or '(' in 'typedef GMatchInfo *GMatchInfo_autoptr;' at 'GMatchInfo_autoptr'
/gnu/store/0wps368gx0cn3ynrkbhzq5pxf75rng7y-glib-2.50.3/include/glib-2.0/glib/glib-autocleanups.h:70: syntax error, unexpected typedef-name, expecting identifier or '(' in 'typedef GScanner *GScanner_autoptr;' at 'GScanner_autoptr'
/gnu/store/0wps368gx0cn3ynrkbhzq5pxf75rng7y-glib-2.50.3/include/glib-2.0/glib/glib-autocleanups.h:71: syntax error, unexpected typedef-name, expecting identifier or '(' in 'typedef GSequence *GSequence_autoptr;' at 'GSequence_autoptr'
/gnu/store/0wps368gx0cn3ynrkbhzq5pxf75rng7y-glib-2.50.3/include/glib-2.0/glib/glib-autocleanups.h:72: syntax error, unexpected typedef-name, expecting identifier or '(' in 'typedef GSList *GSList_autoptr;' at 'GSList_autoptr'
/gnu/store/0wps368gx0cn3ynrkbhzq5pxf75rng7y-glib-2.50.3/include/glib-2.0/glib/glib-autocleanups.h:73: syntax error, unexpected typedef-name, expecting identifier or '(' in 'typedef GString *GString_autoptr;' at 'GString_autoptr'
/gnu/store/0wps368gx0cn3ynrkbhzq5pxf75rng7y-glib-2.50.3/include/glib-2.0/glib/glib-autocleanups.h:74: syntax error, unexpected typedef-name, expecting identifier or '(' in 'typedef GStringChunk *GStringChunk_autoptr;' at 'GStringChunk_autoptr'
/gnu/store/0wps368gx0cn3ynrkbhzq5pxf75rng7y-glib-2.50.3/include/glib-2.0/glib/glib-autocleanups.h:75: syntax error, unexpected typedef-name, expecting identifier or '(' in 'typedef GThread *GThread_autoptr;' at 'GThread_autoptr'
/gnu/store/0wps368gx0cn3ynrkbhzq5pxf75rng7y-glib-2.50.3/include/glib-2.0/glib/glib-autocleanups.h:77: syntax error, unexpected typedef-name, expecting identifier or '(' in 'typedef GMutexLocker *GMutexLocker_autoptr;' at 'GMutexLocker_autoptr'
/gnu/store/0wps368gx0cn3ynrkbhzq5pxf75rng7y-glib-2.50.3/include/glib-2.0/glib/glib-autocleanups.h:79: syntax error, unexpected typedef-name, expecting identifier or '(' in 'typedef GTimer *GTimer_autoptr;' at 'GTimer_autoptr'
/gnu/store/0wps368gx0cn3ynrkbhzq5pxf75rng7y-glib-2.50.3/include/glib-2.0/glib/glib-autocleanups.h:80: syntax error, unexpected typedef-name, expecting identifier or '(' in 'typedef GTimeZone *GTimeZone_autoptr;' at 'GTimeZone_autoptr'
/gnu/store/0wps368gx0cn3ynrkbhzq5pxf75rng7y-glib-2.50.3/include/glib-2.0/glib/glib-autocleanups.h:81: syntax error, unexpected typedef-name, expecting identifier or '(' in 'typedef GTree *GTree_autoptr;' at 'GTree_autoptr'
/gnu/store/0wps368gx0cn3ynrkbhzq5pxf75rng7y-glib-2.50.3/include/glib-2.0/glib/glib-autocleanups.h:82: syntax error, unexpected typedef-name, expecting identifier or '(' in 'typedef GVariant *GVariant_autoptr;' at 'GVariant_autoptr'
/gnu/store/0wps368gx0cn3ynrkbhzq5pxf75rng7y-glib-2.50.3/include/glib-2.0/glib/glib-autocleanups.h:83: syntax error, unexpected typedef-name, expecting identifier or '(' in 'typedef GVariantBuilder *GVariantBuilder_autoptr;' at 'GVariantBuilder_autoptr'
/gnu/store/0wps368gx0cn3ynrkbhzq5pxf75rng7y-glib-2.50.3/include/glib-2.0/glib/glib-autocleanups.h:85: syntax error, unexpected typedef-name, expecting identifier or '(' in 'typedef GVariantIter *GVariantIter_autoptr;' at 'GVariantIter_autoptr'
/gnu/store/0wps368gx0cn3ynrkbhzq5pxf75rng7y-glib-2.50.3/include/glib-2.0/glib/glib-autocleanups.h:86: syntax error, unexpected typedef-name, expecting identifier or '(' in 'typedef GVariantDict *GVariantDict_autoptr;' at 'GVariantDict_autoptr'
/gnu/store/0wps368gx0cn3ynrkbhzq5pxf75rng7y-glib-2.50.3/include/glib-2.0/glib/glib-autocleanups.h:88: syntax error, unexpected typedef-name, expecting identifier or '(' in 'typedef GVariantType *GVariantType_autoptr;' at 'GVariantType_autoptr'
  GICOMP   gir/win32-1.0.gir
  GICOMP   gir/cairo-1.0.gir
g-ir-scanner: GLib: warning: 646 warnings suppressed (use --warn-all to see them)
  GISCAN   GModule-2.0.gir
  GISCAN   GObject-2.0.gir
/gnu/store/0wps368gx0cn3ynrkbhzq5pxf75rng7y-glib-2.50.3/include/glib-2.0/gobject/gobject-autocleanups.h:24: syntax error, unexpected typedef-name, expecting identifier or '(' in 'typedef GObject *GObject_autoptr;' at 'GObject_autoptr'
/gnu/store/0wps368gx0cn3ynrkbhzq5pxf75rng7y-glib-2.50.3/include/glib-2.0/gobject/gobject-autocleanups.h:25: syntax error, unexpected typedef-name, expecting identifier or '(' in 'typedef GInitiallyUnowned *GInitiallyUnowned_autoptr;' at 'GInitiallyUnowned_autoptr'
g-ir-scanner: GModule: warning: 2 warnings suppressed (use --warn-all to see them)
  GICOMP   GLib-2.0.gir
  GICOMP   GModule-2.0.gir
g-ir-scanner: GObject: warning: 19 warnings suppressed (use --warn-all to see them)
  GISCAN   GIRepository-2.0.gir
  GISCAN   Gio-2.0.gir
Traceback (most recent call last):
  File "./g-ir-scanner", line 65, in <module>
    from giscanner.scannermain import scanner_main
  File "./giscanner/scannermain.py", line 38, in <module>
    from giscanner import message
EOFError: EOF read where object expected
make[2]: *** [Makefile:3521: Gio-2.0.gir] Error 1
make[2]: *** Waiting for unfinished jobs....
girepository/girepository.h:232: Warning: GIRepository: symbol='gi_cclosure_marshal_generic': Unknown namespace for symbol 'gi_cclosure_marshal_generic'
girepository/gitypes.h:433: Warning: GIRepository: symbol='GI_TYPE_TAG_N_TYPES': Unknown namespace for symbol 'GI_TYPE_TAG_N_TYPES'
girepository/giunioninfo.c:157: Warning: GIRepository: invalid "transfer" annotation for gint: only valid for array, struct, union, boxed, object and interface types
<unknown>:: Warning: GIRepository: (ErrorQuarkFunction)invoke_error_quark: g_invoke_error_quark: Couldn't find corresponding enumeration
girepository/gitypelib.h:52: Warning: GIRepository: g_typelib_new_from_memory: return value: Invalid non-constant return of bare structure or union; register as boxed type or (skip)
girepository/gitypelib.h:57: Warning: GIRepository: g_typelib_new_from_const_memory: return value: Invalid non-constant return of bare structure or union; register as boxed type or (skip)
girepository/gitypelib.h:62: Warning: GIRepository: g_typelib_new_from_mapped_file: return value: Invalid non-constant return of bare structure or union; register as boxed type or (skip)
girepository/gitypelib.h:52: Warning: GIRepository: g_typelib_new_from_memory: return value: Invalid non-constant return of bare structure or union; register as boxed type or (skip)
girepository/gitypelib.h:57: Warning: GIRepository: g_typelib_new_from_const_memory: return value: Invalid non-constant return of bare structure or union; register as boxed type or (skip)
girepository/gitypelib.h:62: Warning: GIRepository: g_typelib_new_from_mapped_file: return value: Invalid non-constant return of bare structure or union; register as boxed type or (skip)
make[2]: Leaving directory '/tmp/guix-build-gobject-introspection-1.50.0.drv-0/gobject-introspection-1.50.0'
make[1]: *** [Makefile:2810: all-recursive] Error 1
make[1]: Leaving directory '/tmp/guix-build-gobject-introspection-1.50.0.drv-0/gobject-introspection-1.50.0'
make: *** [Makefile:1570: all] Error 2
phase `build' failed after 66.6 seconds
builder for `/gnu/store/gwx9jsqv6jgdns7549dd6knscfrsabb8-gobject-introspection-1.50.0.drv' failed with exit code 1
cannot build derivation `/gnu/store/mn752g1kjvjjr0ar8l1qkf4bg0wpkwzk-harfbuzz-1.4.3.drv': 1 dependencies couldn't be built
cannot build derivation `/gnu/store/7bn3rs15b77piavs9j1a09i9mx11s9dd-mpv-0.25.0.drv': 1 dependencies couldn't be built
guix package: error: build failed: build of `/gnu/store/7bn3rs15b77piavs9j1a09i9mx11s9dd-mpv-0.25.0.drv' failed

This paste has no annotations.

Colorize as:
Show Line Numbers

Lisppaste pastes can be made by anyone at any time. Imagine a fearsomely comprehensive disclaimer of liability. Now fear, comprehensively.