Paste number 352024: qtwebengine build failure guix

Paste number 352024: qtwebengine build failure guix
Pasted by: brendyn
When:5 years, 1 month ago
Share:Tweet this! | http://paste.lisp.org/+7JMG
Channel:None
Paste contents:
Raw Source | XML | Display As
make[3]: Entering directory '/tmp/guix-build-qtwebengine-5.7.1.drv-0/qtwebengine-opensource-src-5.7.1/src/core'
make[3]: Nothing to be done for 'first'.
make[3]: Leaving directory '/tmp/guix-build-qtwebengine-5.7.1.drv-0/qtwebengine-opensource-src-5.7.1/src/core'
/tmp/guix-build-qtwebengine-5.7.1.drv-0/qtwebengine-opensource-src-5.7.1/src/core/core_common.pri:9: 'getChromiumSrcDir' is not a recognized replace function.
/tmp/guix-build-qtwebengine-5.7.1.drv-0/qtwebengine-opensource-src-5.7.1/src/core/core_gyp_generator.pro:21: 'getConfigDir' is not a recognized replace function.
/tmp/guix-build-qtwebengine-5.7.1.drv-0/qtwebengine-opensource-src-5.7.1/src/core/core_gyp_generator.pro:22: 'getConfigDir' is not a recognized replace function.
make[3]: Entering directory '/tmp/guix-build-qtwebengine-5.7.1.drv-0/qtwebengine-opensource-src-5.7.1/src/core'
make[3]: Nothing to be done for 'first'.
make[3]: Leaving directory '/tmp/guix-build-qtwebengine-5.7.1.drv-0/qtwebengine-opensource-src-5.7.1/src/core'
( test -e Makefile.gyp_run || /gnu/store/l1gshi8mxm3k14gn9b96bb81vnmbhm6r-qtbase-5.9.1/bin/qmake -o Makefile.gyp_run /tmp/guix-build-qtwebengine-5.7.1.drv-0/qtwebengine-opensource-src-5.7.1/src/core/gyp_run.pro 'WEBENGINE_CONFIG = use_system_ffmpeg use_system_icu' PREFIX=/gnu/store/mgf1zigik28ddal3i4l7p43c9x8iiq21-qtwebengine-5.7.1 QTWEBENGINE_ROOT=/tmp/guix-build-qtwebengine-5.7.1.drv-0/qtwebengine-opensource-src-5.7.1 ) && make -f Makefile.gyp_run
/tmp/guix-build-qtwebengine-5.7.1.drv-0/qtwebengine-opensource-src-5.7.1/src/core/config/linux.pri:24: 'use?' is not a recognized test function.
/tmp/guix-build-qtwebengine-5.7.1.drv-0/qtwebengine-opensource-src-5.7.1/src/core/config/linux.pri:49: 'use?' is not a recognized test function.
/tmp/guix-build-qtwebengine-5.7.1.drv-0/qtwebengine-opensource-src-5.7.1/src/core/config/linux.pri:50: 'use?' is not a recognized test function.
/tmp/guix-build-qtwebengine-5.7.1.drv-0/qtwebengine-opensource-src-5.7.1/src/core/config/linux.pri:51: 'use?' is not a recognized test function.
/tmp/guix-build-qtwebengine-5.7.1.drv-0/qtwebengine-opensource-src-5.7.1/src/core/config/linux.pri:52: 'use?' is not a recognized test function.
/tmp/guix-build-qtwebengine-5.7.1.drv-0/qtwebengine-opensource-src-5.7.1/src/core/config/linux.pri:53: 'use?' is not a recognized test function.
/tmp/guix-build-qtwebengine-5.7.1.drv-0/qtwebengine-opensource-src-5.7.1/src/core/config/linux.pri:54: 'use?' is not a recognized test function.
/tmp/guix-build-qtwebengine-5.7.1.drv-0/qtwebengine-opensource-src-5.7.1/src/core/config/linux.pri:55: 'use?' is not a recognized test function.
/tmp/guix-build-qtwebengine-5.7.1.drv-0/qtwebengine-opensource-src-5.7.1/src/core/config/linux.pri:56: 'use?' is not a recognized test function.
/tmp/guix-build-qtwebengine-5.7.1.drv-0/qtwebengine-opensource-src-5.7.1/src/core/config/linux.pri:57: 'use?' is not a recognized test function.
/tmp/guix-build-qtwebengine-5.7.1.drv-0/qtwebengine-opensource-src-5.7.1/src/core/config/linux.pri:58: 'use?' is not a recognized test function.
/tmp/guix-build-qtwebengine-5.7.1.drv-0/qtwebengine-opensource-src-5.7.1/src/core/config/linux.pri:59: 'use?' is not a recognized test function.
Project MESSAGE: Running gyp_qtwebengine "/tmp/guix-build-qtwebengine-5.7.1.drv-0/qtwebengine-opensource-src-5.7.1/src/core" -D qt_cross_compile=0 -D qt_os="desktop_linux" -D pkg-config="pkg-config 2> /dev/null" -D use_qt=1 -D v8_use_external_startup_data=0 -D enable_basic_printing=1 -D enable_print_preview=0 -D enable_web_speech=0 -D enable_extensions=0 -D linux_use_bundled_gold=0 -D linux_use_bundled_binutils=0 -D linux_use_gold_flags=0 -D toolkit_uses_gtk=0 -D use_ash=0 -D use_aura=1 -D use_cairo=0 -D use_clipboard_aurax11=0 -D use_cups=0 -D use_gconf=0 -D use_gio=0 -D use_gnome_keyring=0 -D use_kerberos=0 -D use_pango=0 -D use_openssl=1 -D use_nss_certs=0 -D use_openssl_certs=1 -D use_pulseaudio=0 -D use_alsa=0 -D desktop_linux=1 -D enable_widevine=1 -D clang=0 -D host_clang=0 -D qtwe_process_name_debug= -D qtwe_process_name_release= -D disable_glibcxx_debug=1 -D remove_webcore_debug_symbols=1 -D remove_v8base_debug_symbols=1 -D disable_fatal_linker_warnings=1 -D sysroot="" -D target_arch=x64 -D enable_spellcheck=1.
using python: /gnu/store/q5kdj7gpawi94pqd15x3wizjq0nx4zhx-python-2.7.13/bin/python version: 2.7.13
Using extra options found in /tmp/guix-build-qtwebengine-5.7.1.drv-0/qtwebengine-opensource-src-5.7.1/src/core/qmake_extras.gypi
Using extra options found in /tmp/guix-build-qtwebengine-5.7.1.drv-0/qtwebengine-opensource-src-5.7.1/src/core/qtwebengine_extras.gypi
Using extra options found in /tmp/guix-build-qtwebengine-5.7.1.drv-0/qtwebengine-opensource-src-5.7.1/src/core/qmake_extras.gypi
Using extra options found in /tmp/guix-build-qtwebengine-5.7.1.drv-0/qtwebengine-opensource-src-5.7.1/src/core/qtwebengine_extras.gypi
Updating projects from gyp files...
gyp: Call to 'pkg-config 2> /dev/null --cflags x11' returned exit status 127 while in /tmp/guix-build-qtwebengine-5.7.1.drv-0/qtwebengine-opensource-src-5.7.1/src/3rdparty/chromium/build/linux/system.gyp.
Project ERROR: -- running gyp_qtwebengine failed --
make[2]: *** [Makefile:118: sub-gyp_run-pro-make_first] Error 3
make[2]: Leaving directory '/tmp/guix-build-qtwebengine-5.7.1.drv-0/qtwebengine-opensource-src-5.7.1/src/core'
make[1]: *** [Makefile:53: sub-core-make_first] Error 2
make[1]: Leaving directory '/tmp/guix-build-qtwebengine-5.7.1.drv-0/qtwebengine-opensource-src-5.7.1/src'
make: *** [Makefile:47: sub-src-make_first] Error 2
phase `build' failed after 2.3 seconds
builder for `/gnu/store/n4hsazz5gw66nn213awx6v1py1kk2ffa-qtwebengine-5.7.1.drv' failed with exit code 1
@ build-failed /gnu/store/n4hsazz5gw66nn213awx6v1py1kk2ffa-qtwebengine-5.7.1.drv - 1 builder for `/gnu/store/n4hsazz5gw66nn213awx6v1py1kk2ffa-qtwebengine-5.7.1.drv' failed with exit code 1
guix build: error: build failed: build of `/gnu/store/n4hsazz5gw66nn213awx6v1py1kk2ffa-qtwebengine-5.7.1.drv' failed

This paste has no annotations.

Colorize as:
Show Line Numbers

Lisppaste pastes can be made by anyone at any time. Imagine a fearsomely comprehensive disclaimer of liability. Now fear, comprehensively.