Paste number 357450: guix error log

Paste number 357450: guix error log
Pasted by: slim
When:4 years, 10 months ago
Share:Tweet this! | http://paste.lisp.org/+7NT6
Channel:None
Paste contents:
Raw Source | XML | Display As
Starting download of /tmp/guix-file.3OXpiW
From https://git.savannah.gnu.org/cgit/guix.git/snapshot/master.tar.gz...
 ….tar.gz                                   262KiB/s 00:53 | 13.6MiB transferred
dépaquetage « /gnu/store/j6nga81md5vnfrlqdj5wi6cpj2m1rf77-guix-latest.tar.gz »...
							starting phase `set-SOURCE-DATE-EPOCH'
phase `set-SOURCE-DATE-EPOCH' succeeded after 0.0 seconds
starting phase `set-paths'
environment variable `PATH' set to `/gnu/store/mxrygq15595lwm76h11s0dnswz85mav0-autoconf-2.69/bin:/gnu/store/q1l177xwrkb42590d1ml8inwphdqvwik-automake-1.15/bin:/gnu/store/0zngdhf08xma6wwqx5m5pdanrf6j7g53-texinfo-6.3/bin:/gnu/store/ksfpcf0jk6pdxn6c9s9hq0aq9ka0smyx-pkg-config-0.29.1/bin:/gnu/store/w7apxd2iw66i1rbgalx91k8lwn88iqnz-tar-1.29/bin:/gnu/store/m0jw6b2gw7j9yd5x1xxj2py291nscn5n-gzip-1.8/bin:/gnu/store/z0cgrzznk9y94m64mjd8y5pbz0h8ahx3-bzip2-1.0.6/bin:/gnu/store/09lf1q656bqr4k5g241rq1lfjnbkp0zs-xz-5.2.2/bin:/gnu/store/ivbfc0xnjjnxic3kxfsq6qpaxcam50rf-file-5.28/bin:/gnu/store/nxyqg9hjwah4c018zn569nxknp9ri9rm-diffutils-3.5/bin:/gnu/store/fl39ghd3kn8gd0wbxqri9xp1b7sfd7cn-patch-2.7.5/bin:/gnu/store/c1zqminyi4yhmgkkiv36p7r2x4ra17jm-sed-4.4/bin:/gnu/store/n5pawb6fjbk1p7k101bwhnzs0bflj0ai-findutils-4.6.0/bin:/gnu/store/4d9lddi25hspwrdciryyy1kmir1ymddv-gawk-4.1.4/bin:/gnu/store/qz25jjadjplhs610yi5ygy3k6aijk84i-grep-3.0/bin:/gnu/store/ynrp394f7gjalfyh72g0ksby53s1nhl7-coreutils-8.26/bin:/gnu/store/mymn0m1ppcw88r3vgaqq8vlll6dzqmgw-make-4.2.1/bin:/gnu/store/ixvb1magqdw79w9mc1l8p48q5g4n6llq-bash-4.4.12/bin:/gnu/store/1vdsjgizdk2fvm7aik7pfbiaj3jdi6yz-ld-wrapper-0/bin:/gnu/store/f2r94jic8n6fyws20zgg1xss1ghbhyj1-binutils-2.27/bin:/gnu/store/xxmxqnb03kl9m80cfa5cd39rd9naq1h3-gcc-5.4.0/bin:/gnu/store/9q221il27rhf3wi90h8cf32wh961zcjy-glibc-2.25/bin:/gnu/store/9q221il27rhf3wi90h8cf32wh961zcjy-glibc-2.25/sbin:/gnu/store/yf0j9s16dwyfz5y5w6f1z1h4mgf0w1xx-guile-2.2.2/bin:/gnu/store/dgqc0ihh5zbi521h4k106dc08v2xx8vg-openssl-1.0.2k/bin'
environment variable `ACLOCAL_PATH' set to `/gnu/store/q1l177xwrkb42590d1ml8inwphdqvwik-automake-1.15/share/aclocal:/gnu/store/ksfpcf0jk6pdxn6c9s9hq0aq9ka0smyx-pkg-config-0.29.1/share/aclocal:/gnu/store/yf0j9s16dwyfz5y5w6f1z1h4mgf0w1xx-guile-2.2.2/share/aclocal'
environment variable `INFOPATH' set to `/gnu/store/mxrygq15595lwm76h11s0dnswz85mav0-autoconf-2.69/share/info:/gnu/store/q1l177xwrkb42590d1ml8inwphdqvwik-automake-1.15/share/info:/gnu/store/0zngdhf08xma6wwqx5m5pdanrf6j7g53-texinfo-6.3/share/info:/gnu/store/w7apxd2iw66i1rbgalx91k8lwn88iqnz-tar-1.29/share/info:/gnu/store/m0jw6b2gw7j9yd5x1xxj2py291nscn5n-gzip-1.8/share/info:/gnu/store/nxyqg9hjwah4c018zn569nxknp9ri9rm-diffutils-3.5/share/info:/gnu/store/c1zqminyi4yhmgkkiv36p7r2x4ra17jm-sed-4.4/share/info:/gnu/store/n5pawb6fjbk1p7k101bwhnzs0bflj0ai-findutils-4.6.0/share/info:/gnu/store/4d9lddi25hspwrdciryyy1kmir1ymddv-gawk-4.1.4/share/info:/gnu/store/qz25jjadjplhs610yi5ygy3k6aijk84i-grep-3.0/share/info:/gnu/store/ynrp394f7gjalfyh72g0ksby53s1nhl7-coreutils-8.26/share/info:/gnu/store/mymn0m1ppcw88r3vgaqq8vlll6dzqmgw-make-4.2.1/share/info:/gnu/store/ixvb1magqdw79w9mc1l8p48q5g4n6llq-bash-4.4.12/share/info:/gnu/store/f2r94jic8n6fyws20zgg1xss1ghbhyj1-binutils-2.27/share/info:/gnu/store/xxmxqnb03kl9m80cfa5cd39rd9naq1h3-gcc-5.4.0/share/info:/gnu/store/9q221il27rhf3wi90h8cf32wh961zcjy-glibc-2.25/share/info:/gnu/store/yf0j9s16dwyfz5y5w6f1z1h4mgf0w1xx-guile-2.2.2/share/info:/gnu/store/48zp91i8910wv1pihm0yzmps4blgkmn0-gmp-6.1.2/share/info:/gnu/store/3981hp1chx64ycssfv85pns8fs0v0fr7-libunistring-0.9.7/share/info'
environment variable `PKG_CONFIG_PATH' set to `/gnu/store/09lf1q656bqr4k5g241rq1lfjnbkp0zs-xz-5.2.2/lib/pkgconfig:/gnu/store/yf0j9s16dwyfz5y5w6f1z1h4mgf0w1xx-guile-2.2.2/lib/pkgconfig:/gnu/store/5kayawz3z8bypl32gv3lk1pvk3y2wz0v-libgit2-0.25.1/lib/pkgconfig:/gnu/store/gg5h3m2hpmnd6kwi9fzpsavrm2nk832c-libgc-7.6.0/lib/pkgconfig:/gnu/store/kx5221vahkcimkx3qmgpw89i6c9srr0d-zlib-1.2.11/lib/pkgconfig:/gnu/store/dgqc0ihh5zbi521h4k106dc08v2xx8vg-openssl-1.0.2k/lib/pkgconfig'
environment variable `BASH_LOADABLES_PATH' set to `/gnu/store/ixvb1magqdw79w9mc1l8p48q5g4n6llq-bash-4.4.12/lib/bash'
environment variable `C_INCLUDE_PATH' set to `/gnu/store/z0cgrzznk9y94m64mjd8y5pbz0h8ahx3-bzip2-1.0.6/include:/gnu/store/09lf1q656bqr4k5g241rq1lfjnbkp0zs-xz-5.2.2/include:/gnu/store/ivbfc0xnjjnxic3kxfsq6qpaxcam50rf-file-5.28/include:/gnu/store/4d9lddi25hspwrdciryyy1kmir1ymddv-gawk-4.1.4/include:/gnu/store/mymn0m1ppcw88r3vgaqq8vlll6dzqmgw-make-4.2.1/include:/gnu/store/f2r94jic8n6fyws20zgg1xss1ghbhyj1-binutils-2.27/include:/gnu/store/xxmxqnb03kl9m80cfa5cd39rd9naq1h3-gcc-5.4.0/include:/gnu/store/9q221il27rhf3wi90h8cf32wh961zcjy-glibc-2.25/include:/gnu/store/yf0j9s16dwyfz5y5w6f1z1h4mgf0w1xx-guile-2.2.2/include:/gnu/store/5kayawz3z8bypl32gv3lk1pvk3y2wz0v-libgit2-0.25.1/include:/gnu/store/cwls4k58gw85lsrm2m2icpgwhvd0452n-linux-libre-headers-4.4.47/include:/gnu/store/48zp91i8910wv1pihm0yzmps4blgkmn0-gmp-6.1.2/include:/gnu/store/gg5h3m2hpmnd6kwi9fzpsavrm2nk832c-libgc-7.6.0/include:/gnu/store/dcykslfw10qv4hy35w1xw1gyfwgj178d-libltdl-2.4.6/include:/gnu/store/3981hp1chx64ycssfv85pns8fs0v0fr7-libunistring-0.9.7/include:/gnu/store/kx5221vahkcimkx3qmgpw89i6c9srr0d-zlib-1.2.11/include:/gnu/store/dgqc0ihh5zbi521h4k106dc08v2xx8vg-openssl-1.0.2k/include'
environment variable `CPLUS_INCLUDE_PATH' set to `/gnu/store/z0cgrzznk9y94m64mjd8y5pbz0h8ahx3-bzip2-1.0.6/include:/gnu/store/09lf1q656bqr4k5g241rq1lfjnbkp0zs-xz-5.2.2/include:/gnu/store/ivbfc0xnjjnxic3kxfsq6qpaxcam50rf-file-5.28/include:/gnu/store/4d9lddi25hspwrdciryyy1kmir1ymddv-gawk-4.1.4/include:/gnu/store/mymn0m1ppcw88r3vgaqq8vlll6dzqmgw-make-4.2.1/include:/gnu/store/f2r94jic8n6fyws20zgg1xss1ghbhyj1-binutils-2.27/include:/gnu/store/xxmxqnb03kl9m80cfa5cd39rd9naq1h3-gcc-5.4.0/include:/gnu/store/9q221il27rhf3wi90h8cf32wh961zcjy-glibc-2.25/include:/gnu/store/yf0j9s16dwyfz5y5w6f1z1h4mgf0w1xx-guile-2.2.2/include:/gnu/store/5kayawz3z8bypl32gv3lk1pvk3y2wz0v-libgit2-0.25.1/include:/gnu/store/cwls4k58gw85lsrm2m2icpgwhvd0452n-linux-libre-headers-4.4.47/include:/gnu/store/48zp91i8910wv1pihm0yzmps4blgkmn0-gmp-6.1.2/include:/gnu/store/gg5h3m2hpmnd6kwi9fzpsavrm2nk832c-libgc-7.6.0/include:/gnu/store/dcykslfw10qv4hy35w1xw1gyfwgj178d-libltdl-2.4.6/include:/gnu/store/3981hp1chx64ycssfv85pns8fs0v0fr7-libunistring-0.9.7/include:/gnu/store/kx5221vahkcimkx3qmgpw89i6c9srr0d-zlib-1.2.11/include:/gnu/store/dgqc0ihh5zbi521h4k106dc08v2xx8vg-openssl-1.0.2k/include'
environment variable `LIBRARY_PATH' set to `/gnu/store/0zngdhf08xma6wwqx5m5pdanrf6j7g53-texinfo-6.3/lib:/gnu/store/z0cgrzznk9y94m64mjd8y5pbz0h8ahx3-bzip2-1.0.6/lib:/gnu/store/09lf1q656bqr4k5g241rq1lfjnbkp0zs-xz-5.2.2/lib:/gnu/store/ivbfc0xnjjnxic3kxfsq6qpaxcam50rf-file-5.28/lib:/gnu/store/4d9lddi25hspwrdciryyy1kmir1ymddv-gawk-4.1.4/lib:/gnu/store/ixvb1magqdw79w9mc1l8p48q5g4n6llq-bash-4.4.12/lib:/gnu/store/f2r94jic8n6fyws20zgg1xss1ghbhyj1-binutils-2.27/lib:/gnu/store/9q221il27rhf3wi90h8cf32wh961zcjy-glibc-2.25/lib:/gnu/store/x1v2jiga7p0a1q64iyrb1qc48lz2623a-glibc-utf8-locales-2.25/lib:/gnu/store/yf0j9s16dwyfz5y5w6f1z1h4mgf0w1xx-guile-2.2.2/lib:/gnu/store/5kayawz3z8bypl32gv3lk1pvk3y2wz0v-libgit2-0.25.1/lib:/gnu/store/48zp91i8910wv1pihm0yzmps4blgkmn0-gmp-6.1.2/lib:/gnu/store/gg5h3m2hpmnd6kwi9fzpsavrm2nk832c-libgc-7.6.0/lib:/gnu/store/dcykslfw10qv4hy35w1xw1gyfwgj178d-libltdl-2.4.6/lib:/gnu/store/3981hp1chx64ycssfv85pns8fs0v0fr7-libunistring-0.9.7/lib:/gnu/store/kx5221vahkcimkx3qmgpw89i6c9srr0d-zlib-1.2.11/lib:/gnu/store/dgqc0ihh5zbi521h4k106dc08v2xx8vg-openssl-1.0.2k/lib'
environment variable `GUIX_LOCPATH' set to `/gnu/store/x1v2jiga7p0a1q64iyrb1qc48lz2623a-glibc-utf8-locales-2.25/lib/locale'
environment variable `GUILE_LOAD_PATH' set to `/gnu/store/pklccfpph79y0i6ry1bcj63gf9y8c8b4-guile-bytestructures-20170402.91d042e/share/guile/site/2.2'
environment variable `GUILE_LOAD_COMPILED_PATH' set to `/gnu/store/pklccfpph79y0i6ry1bcj63gf9y8c8b4-guile-bytestructures-20170402.91d042e/share/guile/site/2.2'
environment variable `SSL_CERT_DIR' unset
environment variable `SSL_CERT_FILE' unset
phase `set-paths' succeeded after 0.0 seconds
starting phase `install-locale'
using 'en_US.utf8' locale for category "LC_ALL"
phase `install-locale' succeeded after 0.0 seconds
starting phase `unpack'
`/gnu/store/1k1d1w178schkv2d8j1r1mx21jqc501j-guile-git-0.0-3.e156a10-checkout/guile.am' -> `./guile.am'
`/gnu/store/1k1d1w178schkv2d8j1r1mx21jqc501j-guile-git-0.0-3.e156a10-checkout/.gitignore' -> `./.gitignore'
`/gnu/store/1k1d1w178schkv2d8j1r1mx21jqc501j-guile-git-0.0-3.e156a10-checkout/guix.scm' -> `./guix.scm'
`/gnu/store/1k1d1w178schkv2d8j1r1mx21jqc501j-guile-git-0.0-3.e156a10-checkout/COPYING' -> `./COPYING'
`/gnu/store/1k1d1w178schkv2d8j1r1mx21jqc501j-guile-git-0.0-3.e156a10-checkout/Makefile.am' -> `./Makefile.am'
`/gnu/store/1k1d1w178schkv2d8j1r1mx21jqc501j-guile-git-0.0-3.e156a10-checkout/test-env.in' -> `./test-env.in'
`/gnu/store/1k1d1w178schkv2d8j1r1mx21jqc501j-guile-git-0.0-3.e156a10-checkout/pre-inst-env.in' -> `./pre-inst-env.in'
`/gnu/store/1k1d1w178schkv2d8j1r1mx21jqc501j-guile-git-0.0-3.e156a10-checkout/README.md' -> `./README.md'
`/gnu/store/1k1d1w178schkv2d8j1r1mx21jqc501j-guile-git-0.0-3.e156a10-checkout/bootstrap' -> `./bootstrap'
`/gnu/store/1k1d1w178schkv2d8j1r1mx21jqc501j-guile-git-0.0-3.e156a10-checkout/git.scm' -> `./git.scm'
`/gnu/store/1k1d1w178schkv2d8j1r1mx21jqc501j-guile-git-0.0-3.e156a10-checkout/configure.ac' -> `./configure.ac'
`/gnu/store/1k1d1w178schkv2d8j1r1mx21jqc501j-guile-git-0.0-3.e156a10-checkout/.dir-locals.el' -> `./.dir-locals.el'
`/gnu/store/1k1d1w178schkv2d8j1r1mx21jqc501j-guile-git-0.0-3.e156a10-checkout/tests/tree.scm' -> `./tests/tree.scm'
`/gnu/store/1k1d1w178schkv2d8j1r1mx21jqc501j-guile-git-0.0-3.e156a10-checkout/tests/reference.scm' -> `./tests/reference.scm'
`/gnu/store/1k1d1w178schkv2d8j1r1mx21jqc501j-guile-git-0.0-3.e156a10-checkout/tests/commit.scm' -> `./tests/commit.scm'
`/gnu/store/1k1d1w178schkv2d8j1r1mx21jqc501j-guile-git-0.0-3.e156a10-checkout/tests/helpers.scm' -> `./tests/helpers.scm'
`/gnu/store/1k1d1w178schkv2d8j1r1mx21jqc501j-guile-git-0.0-3.e156a10-checkout/tests/oid.scm' -> `./tests/oid.scm'
`/gnu/store/1k1d1w178schkv2d8j1r1mx21jqc501j-guile-git-0.0-3.e156a10-checkout/tests/repository.scm' -> `./tests/repository.scm'
`/gnu/store/1k1d1w178schkv2d8j1r1mx21jqc501j-guile-git-0.0-3.e156a10-checkout/tests/reset.scm' -> `./tests/reset.scm'
`/gnu/store/1k1d1w178schkv2d8j1r1mx21jqc501j-guile-git-0.0-3.e156a10-checkout/tests/status.scm' -> `./tests/status.scm'
`/gnu/store/1k1d1w178schkv2d8j1r1mx21jqc501j-guile-git-0.0-3.e156a10-checkout/tests/branch.scm' -> `./tests/branch.scm'
`/gnu/store/1k1d1w178schkv2d8j1r1mx21jqc501j-guile-git-0.0-3.e156a10-checkout/tests/remote.scm' -> `./tests/remote.scm'
`/gnu/store/1k1d1w178schkv2d8j1r1mx21jqc501j-guile-git-0.0-3.e156a10-checkout/tests/data/simple.tgz' -> `./tests/data/simple.tgz'
`/gnu/store/1k1d1w178schkv2d8j1r1mx21jqc501j-guile-git-0.0-3.e156a10-checkout/tests/data/simple-bare.tgz' -> `./tests/data/simple-bare.tgz'
`/gnu/store/1k1d1w178schkv2d8j1r1mx21jqc501j-guile-git-0.0-3.e156a10-checkout/git/config.scm.in' -> `./git/config.scm.in'
`/gnu/store/1k1d1w178schkv2d8j1r1mx21jqc501j-guile-git-0.0-3.e156a10-checkout/git/tree.scm' -> `./git/tree.scm'
`/gnu/store/1k1d1w178schkv2d8j1r1mx21jqc501j-guile-git-0.0-3.e156a10-checkout/git/errors.scm' -> `./git/errors.scm'
`/gnu/store/1k1d1w178schkv2d8j1r1mx21jqc501j-guile-git-0.0-3.e156a10-checkout/git/tag.scm' -> `./git/tag.scm'
`/gnu/store/1k1d1w178schkv2d8j1r1mx21jqc501j-guile-git-0.0-3.e156a10-checkout/git/reference.scm' -> `./git/reference.scm'
`/gnu/store/1k1d1w178schkv2d8j1r1mx21jqc501j-guile-git-0.0-3.e156a10-checkout/git/annotated.scm' -> `./git/annotated.scm'
`/gnu/store/1k1d1w178schkv2d8j1r1mx21jqc501j-guile-git-0.0-3.e156a10-checkout/git/attr.scm' -> `./git/attr.scm'
`/gnu/store/1k1d1w178schkv2d8j1r1mx21jqc501j-guile-git-0.0-3.e156a10-checkout/git/commit.scm' -> `./git/commit.scm'
`/gnu/store/1k1d1w178schkv2d8j1r1mx21jqc501j-guile-git-0.0-3.e156a10-checkout/git/blob.scm' -> `./git/blob.scm'
`/gnu/store/1k1d1w178schkv2d8j1r1mx21jqc501j-guile-git-0.0-3.e156a10-checkout/git/oid.scm' -> `./git/oid.scm'
`/gnu/store/1k1d1w178schkv2d8j1r1mx21jqc501j-guile-git-0.0-3.e156a10-checkout/git/bindings.scm' -> `./git/bindings.scm'
`/gnu/store/1k1d1w178schkv2d8j1r1mx21jqc501j-guile-git-0.0-3.e156a10-checkout/git/web.scm' -> `./git/web.scm'
`/gnu/store/1k1d1w178schkv2d8j1r1mx21jqc501j-guile-git-0.0-3.e156a10-checkout/git/repository.scm' -> `./git/repository.scm'
`/gnu/store/1k1d1w178schkv2d8j1r1mx21jqc501j-guile-git-0.0-3.e156a10-checkout/git/reset.scm' -> `./git/reset.scm'
`/gnu/store/1k1d1w178schkv2d8j1r1mx21jqc501j-guile-git-0.0-3.e156a10-checkout/git/clone.scm' -> `./git/clone.scm'
`/gnu/store/1k1d1w178schkv2d8j1r1mx21jqc501j-guile-git-0.0-3.e156a10-checkout/git/types.scm' -> `./git/types.scm'
`/gnu/store/1k1d1w178schkv2d8j1r1mx21jqc501j-guile-git-0.0-3.e156a10-checkout/git/status.scm' -> `./git/status.scm'
`/gnu/store/1k1d1w178schkv2d8j1r1mx21jqc501j-guile-git-0.0-3.e156a10-checkout/git/cherrypick.scm' -> `./git/cherrypick.scm'
`/gnu/store/1k1d1w178schkv2d8j1r1mx21jqc501j-guile-git-0.0-3.e156a10-checkout/git/settings.scm' -> `./git/settings.scm'
`/gnu/store/1k1d1w178schkv2d8j1r1mx21jqc501j-guile-git-0.0-3.e156a10-checkout/git/branch.scm' -> `./git/branch.scm'
`/gnu/store/1k1d1w178schkv2d8j1r1mx21jqc501j-guile-git-0.0-3.e156a10-checkout/git/blame.scm' -> `./git/blame.scm'
`/gnu/store/1k1d1w178schkv2d8j1r1mx21jqc501j-guile-git-0.0-3.e156a10-checkout/git/structs.scm' -> `./git/structs.scm'
`/gnu/store/1k1d1w178schkv2d8j1r1mx21jqc501j-guile-git-0.0-3.e156a10-checkout/git/object.scm' -> `./git/object.scm'
`/gnu/store/1k1d1w178schkv2d8j1r1mx21jqc501j-guile-git-0.0-3.e156a10-checkout/git/remote.scm' -> `./git/remote.scm'
`/gnu/store/1k1d1w178schkv2d8j1r1mx21jqc501j-guile-git-0.0-3.e156a10-checkout/git/checkout.scm' -> `./git/checkout.scm'
`/gnu/store/1k1d1w178schkv2d8j1r1mx21jqc501j-guile-git-0.0-3.e156a10-checkout/git/web/template.scm' -> `./git/web/template.scm'
`/gnu/store/1k1d1w178schkv2d8j1r1mx21jqc501j-guile-git-0.0-3.e156a10-checkout/git/web/mime-types.scm' -> `./git/web/mime-types.scm'
`/gnu/store/1k1d1w178schkv2d8j1r1mx21jqc501j-guile-git-0.0-3.e156a10-checkout/git/web/http.scm' -> `./git/web/http.scm'
`/gnu/store/1k1d1w178schkv2d8j1r1mx21jqc501j-guile-git-0.0-3.e156a10-checkout/git/web/html.scm' -> `./git/web/html.scm'
`/gnu/store/1k1d1w178schkv2d8j1r1mx21jqc501j-guile-git-0.0-3.e156a10-checkout/git/web/repository.scm' -> `./git/web/repository.scm'
`/gnu/store/1k1d1w178schkv2d8j1r1mx21jqc501j-guile-git-0.0-3.e156a10-checkout/git/web/querystring.scm' -> `./git/web/querystring.scm'
`/gnu/store/1k1d1w178schkv2d8j1r1mx21jqc501j-guile-git-0.0-3.e156a10-checkout/git/web/config.scm' -> `./git/web/config.scm'
`/gnu/store/1k1d1w178schkv2d8j1r1mx21jqc501j-guile-git-0.0-3.e156a10-checkout/doc/fdl.texi' -> `./doc/fdl.texi'
`/gnu/store/1k1d1w178schkv2d8j1r1mx21jqc501j-guile-git-0.0-3.e156a10-checkout/doc/guile-git.texi' -> `./doc/guile-git.texi'
`/gnu/store/1k1d1w178schkv2d8j1r1mx21jqc501j-guile-git-0.0-3.e156a10-checkout/doc/local.mk' -> `./doc/local.mk'
`/gnu/store/1k1d1w178schkv2d8j1r1mx21jqc501j-guile-git-0.0-3.e156a10-checkout/m4/guile.m4' -> `./m4/guile.m4'
`/gnu/store/1k1d1w178schkv2d8j1r1mx21jqc501j-guile-git-0.0-3.e156a10-checkout/build-aux/test-driver.scm' -> `./build-aux/test-driver.scm'
`/gnu/store/1k1d1w178schkv2d8j1r1mx21jqc501j-guile-git-0.0-3.e156a10-checkout/static/main.css' -> `./static/main.css'
`/gnu/store/1k1d1w178schkv2d8j1r1mx21jqc501j-guile-git-0.0-3.e156a10-checkout/static/normalize.css' -> `./static/normalize.css'
`/gnu/store/1k1d1w178schkv2d8j1r1mx21jqc501j-guile-git-0.0-3.e156a10-checkout/static/bg.png' -> `./static/bg.png'
phase `unpack' succeeded after 0.1 seconds
starting phase `bootstrap'
autoreconf: Entering directory `.'
autoreconf: configure.ac: not using Gettext
autoreconf: running: aclocal --force 
autoreconf: configure.ac: tracing
autoreconf: configure.ac: not using Libtool
autoreconf: running: /gnu/store/mxrygq15595lwm76h11s0dnswz85mav0-autoconf-2.69/bin/autoconf --force
autoreconf: configure.ac: not using Autoheader
autoreconf: running: automake --add-missing --copy --force-missing
configure.ac:6: installing 'build-aux/install-sh'
configure.ac:6: installing 'build-aux/missing'
doc/local.mk:2: installing 'build-aux/mdate-sh'
Makefile.am:70:   'doc/local.mk' included from here
doc/local.mk:2: installing 'build-aux/texinfo.tex'
Makefile.am:70:   'doc/local.mk' included from here
autoreconf: Leaving directory `.'
phase `bootstrap' succeeded after 10.9 seconds
starting phase `patch-usr-bin-file'
phase `patch-usr-bin-file' succeeded after 0.3 seconds
starting phase `patch-source-shebangs'
patch-shebang: ./bootstrap: changing `/bin/sh' to `/gnu/store/ixvb1magqdw79w9mc1l8p48q5g4n6llq-bash-4.4.12/bin/sh'
patch-shebang: ./build-aux/install-sh: changing `/bin/sh' to `/gnu/store/ixvb1magqdw79w9mc1l8p48q5g4n6llq-bash-4.4.12/bin/sh'
patch-shebang: ./build-aux/mdate-sh: changing `/bin/sh' to `/gnu/store/ixvb1magqdw79w9mc1l8p48q5g4n6llq-bash-4.4.12/bin/sh'
patch-shebang: ./build-aux/missing: changing `/bin/sh' to `/gnu/store/ixvb1magqdw79w9mc1l8p48q5g4n6llq-bash-4.4.12/bin/sh'
patch-shebang: ./configure: changing `/bin/sh' to `/gnu/store/ixvb1magqdw79w9mc1l8p48q5g4n6llq-bash-4.4.12/bin/sh'
patch-shebang: ./pre-inst-env.in: changing `/bin/sh' to `/gnu/store/ixvb1magqdw79w9mc1l8p48q5g4n6llq-bash-4.4.12/bin/sh'
patch-shebang: ./test-env.in: changing `/bin/sh' to `/gnu/store/ixvb1magqdw79w9mc1l8p48q5g4n6llq-bash-4.4.12/bin/sh'
phase `patch-source-shebangs' succeeded after 0.1 seconds
starting phase `configure'
source directory: "/tmp/guix-build-guile-git-0.0-3.e156a10.drv-0/source" (relative from build: ".")
build directory: "/tmp/guix-build-guile-git-0.0-3.e156a10.drv-0/source"
configure flags: ("CONFIG_SHELL=/gnu/store/ixvb1magqdw79w9mc1l8p48q5g4n6llq-bash-4.4.12/bin/bash" "SHELL=/gnu/store/ixvb1magqdw79w9mc1l8p48q5g4n6llq-bash-4.4.12/bin/bash" "--prefix=/gnu/store/ffsrv2335mdwp8rwj2lkg6g1ylh23yx4-guile-git-0.0-3.e156a10" "--enable-fast-install" "--build=i686-unknown-linux-gnu")
configure: WARNING: unrecognized options: --enable-fast-install
checking for a BSD-compatible install... /gnu/store/ynrp394f7gjalfyh72g0ksby53s1nhl7-coreutils-8.26/bin/install -c
checking whether build environment is sane... yes
checking for a thread-safe mkdir -p... /gnu/store/ynrp394f7gjalfyh72g0ksby53s1nhl7-coreutils-8.26/bin/mkdir -p
checking for gawk... gawk
checking whether make sets $(MAKE)... no
checking whether make supports nested variables... yes
checking whether make supports nested variables... (cached) yes
checking for pkg-config... /gnu/store/ksfpcf0jk6pdxn6c9s9hq0aq9ka0smyx-pkg-config-0.29.1/bin/pkg-config
checking pkg-config is at least version 0.9.0... yes
configure: checking for guile 2.2
configure: found guile 2.2
checking for guile... /gnu/store/yf0j9s16dwyfz5y5w6f1z1h4mgf0w1xx-guile-2.2.2/bin/guile
checking for Guile version >= 2.2... 2.2.2
checking for guild... /gnu/store/yf0j9s16dwyfz5y5w6f1z1h4mgf0w1xx-guile-2.2.2/bin/guild
checking for guile-config... /gnu/store/yf0j9s16dwyfz5y5w6f1z1h4mgf0w1xx-guile-2.2.2/bin/guile-config
checking if (srfi srfi-64) is available... yes
checking if (bytestructures guile) is available... yes
checking for LIBGIT2... yes
checking libgit2 library path... checking that generated files are newer than configure... done
configure: creating ./config.status
config.status: creating Makefile
config.status: creating git/config.scm
config.status: creating pre-inst-env
config.status: creating test-env
configure: WARNING: unrecognized options: --enable-fast-install
phase `configure' succeeded after 2.1 seconds
starting phase `patch-generated-file-shebangs'
phase `patch-generated-file-shebangs' succeeded after 0.1 seconds
starting phase `build'
  GEN      git.go
make[1]: Entering directory '/tmp/guix-build-guile-git-0.0-3.e156a10.drv-0/source'
make[1]: Leaving directory '/tmp/guix-build-guile-git-0.0-3.e156a10.drv-0/source'
Updating ./doc/version.texi
  GEN      git/annotated.go
wrote `git.go'
;;; note: auto-compilation is enabled, set GUILE_AUTO_COMPILE=0
;;;       or pass the --no-auto-compile argument to disable.
;;; compiling /gnu/store/yf0j9s16dwyfz5y5w6f1z1h4mgf0w1xx-guile-2.2.2/bin/guild
;;; WARNING: compilation of /gnu/store/yf0j9s16dwyfz5y5w6f1z1h4mgf0w1xx-guile-2.2.2/bin/guild failed:
;;; ERROR: failed to create path for auto-compiled file "/gnu/store/yf0j9s16dwyfz5y5w6f1z1h4mgf0w1xx-guile-2.2.2/bin/guild"
  GEN      git/attr.go
wrote `git/annotated.go'
;;; note: auto-compilation is enabled, set GUILE_AUTO_COMPILE=0
;;;       or pass the --no-auto-compile argument to disable.
;;; compiling /gnu/store/yf0j9s16dwyfz5y5w6f1z1h4mgf0w1xx-guile-2.2.2/bin/guild
;;; WARNING: compilation of /gnu/store/yf0j9s16dwyfz5y5w6f1z1h4mgf0w1xx-guile-2.2.2/bin/guild failed:
;;; ERROR: failed to create path for auto-compiled file "/gnu/store/yf0j9s16dwyfz5y5w6f1z1h4mgf0w1xx-guile-2.2.2/bin/guild"
  GEN      git/bindings.go
wrote `git/attr.go'
;;; note: auto-compilation is enabled, set GUILE_AUTO_COMPILE=0
;;;       or pass the --no-auto-compile argument to disable.
;;; compiling /gnu/store/yf0j9s16dwyfz5y5w6f1z1h4mgf0w1xx-guile-2.2.2/bin/guild
;;; WARNING: compilation of /gnu/store/yf0j9s16dwyfz5y5w6f1z1h4mgf0w1xx-guile-2.2.2/bin/guild failed:
;;; ERROR: failed to create path for auto-compiled file "/gnu/store/yf0j9s16dwyfz5y5w6f1z1h4mgf0w1xx-guile-2.2.2/bin/guild"
  GEN      git/blame.go
wrote `git/blame.go'
;;; note: auto-compilation is enabled, set GUILE_AUTO_COMPILE=0
;;;       or pass the --no-auto-compile argument to disable.
;;; compiling /gnu/store/yf0j9s16dwyfz5y5w6f1z1h4mgf0w1xx-guile-2.2.2/bin/guild
;;; WARNING: compilation of /gnu/store/yf0j9s16dwyfz5y5w6f1z1h4mgf0w1xx-guile-2.2.2/bin/guild failed:
;;; ERROR: failed to create path for auto-compiled file "/gnu/store/yf0j9s16dwyfz5y5w6f1z1h4mgf0w1xx-guile-2.2.2/bin/guild"
  GEN      git/blob.go
wrote `git/bindings.go'
;;; note: auto-compilation is enabled, set GUILE_AUTO_COMPILE=0
;;;       or pass the --no-auto-compile argument to disable.
;;; compiling /gnu/store/yf0j9s16dwyfz5y5w6f1z1h4mgf0w1xx-guile-2.2.2/bin/guild
;;; WARNING: compilation of /gnu/store/yf0j9s16dwyfz5y5w6f1z1h4mgf0w1xx-guile-2.2.2/bin/guild failed:
;;; ERROR: failed to create path for auto-compiled file "/gnu/store/yf0j9s16dwyfz5y5w6f1z1h4mgf0w1xx-guile-2.2.2/bin/guild"
  GEN      git/branch.go
wrote `git/blob.go'
;;; note: auto-compilation is enabled, set GUILE_AUTO_COMPILE=0
;;;       or pass the --no-auto-compile argument to disable.
;;; compiling /gnu/store/yf0j9s16dwyfz5y5w6f1z1h4mgf0w1xx-guile-2.2.2/bin/guild
;;; WARNING: compilation of /gnu/store/yf0j9s16dwyfz5y5w6f1z1h4mgf0w1xx-guile-2.2.2/bin/guild failed:
;;; ERROR: failed to create path for auto-compiled file "/gnu/store/yf0j9s16dwyfz5y5w6f1z1h4mgf0w1xx-guile-2.2.2/bin/guild"
  GEN      git/checkout.go
wrote `git/checkout.go'
;;; note: auto-compilation is enabled, set GUILE_AUTO_COMPILE=0
;;;       or pass the --no-auto-compile argument to disable.
;;; compiling /gnu/store/yf0j9s16dwyfz5y5w6f1z1h4mgf0w1xx-guile-2.2.2/bin/guild
;;; WARNING: compilation of /gnu/store/yf0j9s16dwyfz5y5w6f1z1h4mgf0w1xx-guile-2.2.2/bin/guild failed:
;;; ERROR: failed to create path for auto-compiled file "/gnu/store/yf0j9s16dwyfz5y5w6f1z1h4mgf0w1xx-guile-2.2.2/bin/guild"
  GEN      git/cherrypick.go
wrote `git/cherrypick.go'
;;; note: auto-compilation is enabled, set GUILE_AUTO_COMPILE=0
;;;       or pass the --no-auto-compile argument to disable.
;;; compiling /gnu/store/yf0j9s16dwyfz5y5w6f1z1h4mgf0w1xx-guile-2.2.2/bin/guild
;;; WARNING: compilation of /gnu/store/yf0j9s16dwyfz5y5w6f1z1h4mgf0w1xx-guile-2.2.2/bin/guild failed:
;;; ERROR: failed to create path for auto-compiled file "/gnu/store/yf0j9s16dwyfz5y5w6f1z1h4mgf0w1xx-guile-2.2.2/bin/guild"
  GEN      git/clone.go
wrote `git/branch.go'
;;; note: auto-compilation is enabled, set GUILE_AUTO_COMPILE=0
;;;       or pass the --no-auto-compile argument to disable.
;;; compiling /gnu/store/yf0j9s16dwyfz5y5w6f1z1h4mgf0w1xx-guile-2.2.2/bin/guild
;;; WARNING: compilation of /gnu/store/yf0j9s16dwyfz5y5w6f1z1h4mgf0w1xx-guile-2.2.2/bin/guild failed:
;;; ERROR: failed to create path for auto-compiled file "/gnu/store/yf0j9s16dwyfz5y5w6f1z1h4mgf0w1xx-guile-2.2.2/bin/guild"
  GEN      git/commit.go
wrote `git/clone.go'
;;; note: auto-compilation is enabled, set GUILE_AUTO_COMPILE=0
;;;       or pass the --no-auto-compile argument to disable.
;;; compiling /gnu/store/yf0j9s16dwyfz5y5w6f1z1h4mgf0w1xx-guile-2.2.2/bin/guild
;;; WARNING: compilation of /gnu/store/yf0j9s16dwyfz5y5w6f1z1h4mgf0w1xx-guile-2.2.2/bin/guild failed:
;;; ERROR: failed to create path for auto-compiled file "/gnu/store/yf0j9s16dwyfz5y5w6f1z1h4mgf0w1xx-guile-2.2.2/bin/guild"
  GEN      git/config.go
wrote `git/config.go'
;;; note: auto-compilation is enabled, set GUILE_AUTO_COMPILE=0
;;;       or pass the --no-auto-compile argument to disable.
;;; compiling /gnu/store/yf0j9s16dwyfz5y5w6f1z1h4mgf0w1xx-guile-2.2.2/bin/guild
;;; WARNING: compilation of /gnu/store/yf0j9s16dwyfz5y5w6f1z1h4mgf0w1xx-guile-2.2.2/bin/guild failed:
;;; ERROR: failed to create path for auto-compiled file "/gnu/store/yf0j9s16dwyfz5y5w6f1z1h4mgf0w1xx-guile-2.2.2/bin/guild"
  GEN      git/errors.go
wrote `git/errors.go'
;;; note: auto-compilation is enabled, set GUILE_AUTO_COMPILE=0
;;;       or pass the --no-auto-compile argument to disable.
;;; compiling /gnu/store/yf0j9s16dwyfz5y5w6f1z1h4mgf0w1xx-guile-2.2.2/bin/guild
;;; WARNING: compilation of /gnu/store/yf0j9s16dwyfz5y5w6f1z1h4mgf0w1xx-guile-2.2.2/bin/guild failed:
;;; ERROR: failed to create path for auto-compiled file "/gnu/store/yf0j9s16dwyfz5y5w6f1z1h4mgf0w1xx-guile-2.2.2/bin/guild"
  GEN      git/oid.go
wrote `git/commit.go'
;;; note: auto-compilation is enabled, set GUILE_AUTO_COMPILE=0
;;;       or pass the --no-auto-compile argument to disable.
;;; compiling /gnu/store/yf0j9s16dwyfz5y5w6f1z1h4mgf0w1xx-guile-2.2.2/bin/guild
;;; WARNING: compilation of /gnu/store/yf0j9s16dwyfz5y5w6f1z1h4mgf0w1xx-guile-2.2.2/bin/guild failed:
;;; ERROR: failed to create path for auto-compiled file "/gnu/store/yf0j9s16dwyfz5y5w6f1z1h4mgf0w1xx-guile-2.2.2/bin/guild"
  GEN      git/object.go
wrote `git/oid.go'
;;; note: auto-compilation is enabled, set GUILE_AUTO_COMPILE=0
;;;       or pass the --no-auto-compile argument to disable.
;;; compiling /gnu/store/yf0j9s16dwyfz5y5w6f1z1h4mgf0w1xx-guile-2.2.2/bin/guild
;;; WARNING: compilation of /gnu/store/yf0j9s16dwyfz5y5w6f1z1h4mgf0w1xx-guile-2.2.2/bin/guild failed:
;;; ERROR: failed to create path for auto-compiled file "/gnu/store/yf0j9s16dwyfz5y5w6f1z1h4mgf0w1xx-guile-2.2.2/bin/guild"
  GEN      git/reference.go
wrote `git/object.go'
;;; note: auto-compilation is enabled, set GUILE_AUTO_COMPILE=0
;;;       or pass the --no-auto-compile argument to disable.
;;; compiling /gnu/store/yf0j9s16dwyfz5y5w6f1z1h4mgf0w1xx-guile-2.2.2/bin/guild
;;; WARNING: compilation of /gnu/store/yf0j9s16dwyfz5y5w6f1z1h4mgf0w1xx-guile-2.2.2/bin/guild failed:
;;; ERROR: failed to create path for auto-compiled file "/gnu/store/yf0j9s16dwyfz5y5w6f1z1h4mgf0w1xx-guile-2.2.2/bin/guild"
  GEN      git/repository.go
wrote `git/reference.go'
;;; note: auto-compilation is enabled, set GUILE_AUTO_COMPILE=0
;;;       or pass the --no-auto-compile argument to disable.
;;; compiling /gnu/store/yf0j9s16dwyfz5y5w6f1z1h4mgf0w1xx-guile-2.2.2/bin/guild
;;; WARNING: compilation of /gnu/store/yf0j9s16dwyfz5y5w6f1z1h4mgf0w1xx-guile-2.2.2/bin/guild failed:
;;; ERROR: failed to create path for auto-compiled file "/gnu/store/yf0j9s16dwyfz5y5w6f1z1h4mgf0w1xx-guile-2.2.2/bin/guild"
  GEN      git/reset.go
wrote `git/reset.go'
;;; note: auto-compilation is enabled, set GUILE_AUTO_COMPILE=0
;;;       or pass the --no-auto-compile argument to disable.
;;; compiling /gnu/store/yf0j9s16dwyfz5y5w6f1z1h4mgf0w1xx-guile-2.2.2/bin/guild
;;; WARNING: compilation of /gnu/store/yf0j9s16dwyfz5y5w6f1z1h4mgf0w1xx-guile-2.2.2/bin/guild failed:
;;; ERROR: failed to create path for auto-compiled file "/gnu/store/yf0j9s16dwyfz5y5w6f1z1h4mgf0w1xx-guile-2.2.2/bin/guild"
  GEN      git/remote.go
wrote `git/repository.go'
;;; note: auto-compilation is enabled, set GUILE_AUTO_COMPILE=0
;;;       or pass the --no-auto-compile argument to disable.
;;; compiling /gnu/store/yf0j9s16dwyfz5y5w6f1z1h4mgf0w1xx-guile-2.2.2/bin/guild
;;; WARNING: compilation of /gnu/store/yf0j9s16dwyfz5y5w6f1z1h4mgf0w1xx-guile-2.2.2/bin/guild failed:
;;; ERROR: failed to create path for auto-compiled file "/gnu/store/yf0j9s16dwyfz5y5w6f1z1h4mgf0w1xx-guile-2.2.2/bin/guild"
  GEN      git/settings.go
wrote `git/remote.go'
;;; note: auto-compilation is enabled, set GUILE_AUTO_COMPILE=0
;;;       or pass the --no-auto-compile argument to disable.
;;; compiling /gnu/store/yf0j9s16dwyfz5y5w6f1z1h4mgf0w1xx-guile-2.2.2/bin/guild
;;; WARNING: compilation of /gnu/store/yf0j9s16dwyfz5y5w6f1z1h4mgf0w1xx-guile-2.2.2/bin/guild failed:
;;; ERROR: failed to create path for auto-compiled file "/gnu/store/yf0j9s16dwyfz5y5w6f1z1h4mgf0w1xx-guile-2.2.2/bin/guild"
  GEN      git/status.go
wrote `git/settings.go'
;;; note: auto-compilation is enabled, set GUILE_AUTO_COMPILE=0
;;;       or pass the --no-auto-compile argument to disable.
;;; compiling /gnu/store/yf0j9s16dwyfz5y5w6f1z1h4mgf0w1xx-guile-2.2.2/bin/guild
;;; WARNING: compilation of /gnu/store/yf0j9s16dwyfz5y5w6f1z1h4mgf0w1xx-guile-2.2.2/bin/guild failed:
;;; ERROR: failed to create path for auto-compiled file "/gnu/store/yf0j9s16dwyfz5y5w6f1z1h4mgf0w1xx-guile-2.2.2/bin/guild"
  GEN      git/structs.go
wrote `git/status.go'
;;; note: auto-compilation is enabled, set GUILE_AUTO_COMPILE=0
;;;       or pass the --no-auto-compile argument to disable.
;;; compiling /gnu/store/yf0j9s16dwyfz5y5w6f1z1h4mgf0w1xx-guile-2.2.2/bin/guild
;;; WARNING: compilation of /gnu/store/yf0j9s16dwyfz5y5w6f1z1h4mgf0w1xx-guile-2.2.2/bin/guild failed:
;;; ERROR: failed to create path for auto-compiled file "/gnu/store/yf0j9s16dwyfz5y5w6f1z1h4mgf0w1xx-guile-2.2.2/bin/guild"
  GEN      git/tag.go
wrote `git/tag.go'
;;; note: auto-compilation is enabled, set GUILE_AUTO_COMPILE=0
;;;       or pass the --no-auto-compile argument to disable.
;;; compiling /gnu/store/yf0j9s16dwyfz5y5w6f1z1h4mgf0w1xx-guile-2.2.2/bin/guild
;;; WARNING: compilation of /gnu/store/yf0j9s16dwyfz5y5w6f1z1h4mgf0w1xx-guile-2.2.2/bin/guild failed:
;;; ERROR: failed to create path for auto-compiled file "/gnu/store/yf0j9s16dwyfz5y5w6f1z1h4mgf0w1xx-guile-2.2.2/bin/guild"
  GEN      git/tree.go
wrote `git/tree.go'
;;; note: auto-compilation is enabled, set GUILE_AUTO_COMPILE=0
;;;       or pass the --no-auto-compile argument to disable.
;;; compiling /gnu/store/yf0j9s16dwyfz5y5w6f1z1h4mgf0w1xx-guile-2.2.2/bin/guild
;;; WARNING: compilation of /gnu/store/yf0j9s16dwyfz5y5w6f1z1h4mgf0w1xx-guile-2.2.2/bin/guild failed:
;;; ERROR: failed to create path for auto-compiled file "/gnu/store/yf0j9s16dwyfz5y5w6f1z1h4mgf0w1xx-guile-2.2.2/bin/guild"
  GEN      git/types.go
wrote `git/structs.go'
;;; note: auto-compilation is enabled, set GUILE_AUTO_COMPILE=0
;;;       or pass the --no-auto-compile argument to disable.
;;; compiling /gnu/store/yf0j9s16dwyfz5y5w6f1z1h4mgf0w1xx-guile-2.2.2/bin/guild
;;; WARNING: compilation of /gnu/store/yf0j9s16dwyfz5y5w6f1z1h4mgf0w1xx-guile-2.2.2/bin/guild failed:
;;; ERROR: failed to create path for auto-compiled file "/gnu/store/yf0j9s16dwyfz5y5w6f1z1h4mgf0w1xx-guile-2.2.2/bin/guild"
  GEN      git/web.go
wrote `git/web.go'
;;; note: auto-compilation is enabled, set GUILE_AUTO_COMPILE=0
;;;       or pass the --no-auto-compile argument to disable.
;;; compiling /gnu/store/yf0j9s16dwyfz5y5w6f1z1h4mgf0w1xx-guile-2.2.2/bin/guild
;;; WARNING: compilation of /gnu/store/yf0j9s16dwyfz5y5w6f1z1h4mgf0w1xx-guile-2.2.2/bin/guild failed:
;;; ERROR: failed to create path for auto-compiled file "/gnu/store/yf0j9s16dwyfz5y5w6f1z1h4mgf0w1xx-guile-2.2.2/bin/guild"
  GEN      git/web/html.go
wrote `git/web/html.go'
;;; note: auto-compilation is enabled, set GUILE_AUTO_COMPILE=0
;;;       or pass the --no-auto-compile argument to disable.
;;; compiling /gnu/store/yf0j9s16dwyfz5y5w6f1z1h4mgf0w1xx-guile-2.2.2/bin/guild
;;; WARNING: compilation of /gnu/store/yf0j9s16dwyfz5y5w6f1z1h4mgf0w1xx-guile-2.2.2/bin/guild failed:
;;; ERROR: failed to create path for auto-compiled file "/gnu/store/yf0j9s16dwyfz5y5w6f1z1h4mgf0w1xx-guile-2.2.2/bin/guild"
  GEN      git/web/mime-types.go
wrote `git/web/mime-types.go'
;;; note: auto-compilation is enabled, set GUILE_AUTO_COMPILE=0
;;;       or pass the --no-auto-compile argument to disable.
;;; compiling /gnu/store/yf0j9s16dwyfz5y5w6f1z1h4mgf0w1xx-guile-2.2.2/bin/guild
;;; WARNING: compilation of /gnu/store/yf0j9s16dwyfz5y5w6f1z1h4mgf0w1xx-guile-2.2.2/bin/guild failed:
;;; ERROR: failed to create path for auto-compiled file "/gnu/store/yf0j9s16dwyfz5y5w6f1z1h4mgf0w1xx-guile-2.2.2/bin/guild"
  GEN      git/web/querystring.go
wrote `git/web/querystring.go'
;;; note: auto-compilation is enabled, set GUILE_AUTO_COMPILE=0
;;;       or pass the --no-auto-compile argument to disable.
;;; compiling /gnu/store/yf0j9s16dwyfz5y5w6f1z1h4mgf0w1xx-guile-2.2.2/bin/guild
;;; WARNING: compilation of /gnu/store/yf0j9s16dwyfz5y5w6f1z1h4mgf0w1xx-guile-2.2.2/bin/guild failed:
;;; ERROR: failed to create path for auto-compiled file "/gnu/store/yf0j9s16dwyfz5y5w6f1z1h4mgf0w1xx-guile-2.2.2/bin/guild"
  GEN      git/web/http.go
wrote `git/web/http.go'
;;; note: auto-compilation is enabled, set GUILE_AUTO_COMPILE=0
;;;       or pass the --no-auto-compile argument to disable.
;;; compiling /gnu/store/yf0j9s16dwyfz5y5w6f1z1h4mgf0w1xx-guile-2.2.2/bin/guild
;;; WARNING: compilation of /gnu/store/yf0j9s16dwyfz5y5w6f1z1h4mgf0w1xx-guile-2.2.2/bin/guild failed:
;;; ERROR: failed to create path for auto-compiled file "/gnu/store/yf0j9s16dwyfz5y5w6f1z1h4mgf0w1xx-guile-2.2.2/bin/guild"
  GEN      git/web/template.go
wrote `git/web/template.go'
;;; note: auto-compilation is enabled, set GUILE_AUTO_COMPILE=0
;;;       or pass the --no-auto-compile argument to disable.
;;; compiling /gnu/store/yf0j9s16dwyfz5y5w6f1z1h4mgf0w1xx-guile-2.2.2/bin/guild
;;; WARNING: compilation of /gnu/store/yf0j9s16dwyfz5y5w6f1z1h4mgf0w1xx-guile-2.2.2/bin/guild failed:
;;; ERROR: failed to create path for auto-compiled file "/gnu/store/yf0j9s16dwyfz5y5w6f1z1h4mgf0w1xx-guile-2.2.2/bin/guild"
  GEN      git/web/config.go
wrote `git/web/config.go'
;;; note: auto-compilation is enabled, set GUILE_AUTO_COMPILE=0
;;;       or pass the --no-auto-compile argument to disable.
;;; compiling /gnu/store/yf0j9s16dwyfz5y5w6f1z1h4mgf0w1xx-guile-2.2.2/bin/guild
;;; WARNING: compilation of /gnu/store/yf0j9s16dwyfz5y5w6f1z1h4mgf0w1xx-guile-2.2.2/bin/guild failed:
;;; ERROR: failed to create path for auto-compiled file "/gnu/store/yf0j9s16dwyfz5y5w6f1z1h4mgf0w1xx-guile-2.2.2/bin/guild"
  GEN      git/web/repository.go
wrote `git/web/repository.go'
;;; note: auto-compilation is enabled, set GUILE_AUTO_COMPILE=0
;;;       or pass the --no-auto-compile argument to disable.
;;; compiling /gnu/store/yf0j9s16dwyfz5y5w6f1z1h4mgf0w1xx-guile-2.2.2/bin/guild
;;; WARNING: compilation of /gnu/store/yf0j9s16dwyfz5y5w6f1z1h4mgf0w1xx-guile-2.2.2/bin/guild failed:
;;; ERROR: failed to create path for auto-compiled file "/gnu/store/yf0j9s16dwyfz5y5w6f1z1h4mgf0w1xx-guile-2.2.2/bin/guild"
  MAKEINFO doc/guile-git.info
wrote `git/types.go'
;;; note: auto-compilation is enabled, set GUILE_AUTO_COMPILE=0
;;;       or pass the --no-auto-compile argument to disable.
;;; compiling /gnu/store/yf0j9s16dwyfz5y5w6f1z1h4mgf0w1xx-guile-2.2.2/bin/guild
;;; WARNING: compilation of /gnu/store/yf0j9s16dwyfz5y5w6f1z1h4mgf0w1xx-guile-2.2.2/bin/guild failed:
;;; ERROR: failed to create path for auto-compiled file "/gnu/store/yf0j9s16dwyfz5y5w6f1z1h4mgf0w1xx-guile-2.2.2/bin/guild"
phase `build' succeeded after 165.1 seconds
starting phase `check'
make  check-TESTS
make[1]: Entering directory '/tmp/guix-build-guile-git-0.0-3.e156a10.drv-0/source'
make[2]: Entering directory '/tmp/guix-build-guile-git-0.0-3.e156a10.drv-0/source'
PASS: tests/branch.scm
PASS: tests/commit.scm
PASS: tests/oid.scm
PASS: tests/reference.scm
PASS: tests/repository.scm
PASS: tests/reset.scm
PASS: tests/remote.scm
PASS: tests/tree.scm
/gnu/store/ixvb1magqdw79w9mc1l8p48q5g4n6llq-bash-4.4.12/bin/bash: line 5:  1116 Segmentation fault      ./pre-inst-env /gnu/store/yf0j9s16dwyfz5y5w6f1z1h4mgf0w1xx-guile-2.2.2/bin/guile --no-auto-compile -e main ./build-aux/test-driver.scm --test-name "$f" --log-file $b.log --trs-file $b.trs --color-tests "$am__color_tests" --enable-hard-errors "$am__enable_hard_errors" --expect-failure "$am__expect_failure" --brief=yes -- --no-auto-compile -L "." "$tst"
make[2]: *** [Makefile:1027: tests/status.log] Error 139
make[2]: Leaving directory '/tmp/guix-build-guile-git-0.0-3.e156a10.drv-0/source'
make[1]: *** [Makefile:1009: check-TESTS] Error 2
make[1]: Leaving directory '/tmp/guix-build-guile-git-0.0-3.e156a10.drv-0/source'
make: *** [Makefile:1201: check-am] Error 2
phase `check' failed after 4.4 seconds
builder for `/gnu/store/z99jmrjnzd30w28px70qp4q0s1pc34g3-guile-git-0.0-3.e156a10.drv' failed with exit code 1
guix pull: error: build failed: build of `/gnu/store/z99jmrjnzd30w28px70qp4q0s1pc34g3-guile-git-0.0-3.e156a10.drv' failed

This paste has no annotations.

Colorize as:
Show Line Numbers

Lisppaste pastes can be made by anyone at any time. Imagine a fearsomely comprehensive disclaimer of liability. Now fear, comprehensively.